{"text_format":"1","workbook":"xlsx","n_sheets":11,"sheets":["Instructions","All Steel Raw Materials Symbols","Key Steel Raw Materials","My List - Latest Prices","My List - Average Prices","My List - Convert Currency_UOM","Historical Data - Single Price","Datagenics","Morningstar","Reuters","Bloomberg"],"not_rendered":{"charts":1,"images":1,"macros":1,"external_links":1,"defined_names":4,"comments":0,"pivot_tables":0},"unopened":[],"bounds":{"document_bytes":16777216,"sheet_cells":100000,"rows_first":2000,"rows_last":500,"rows_between":2000,"halvings":0,"cell_chars":16384,"cell_head_chars":4096},"cells_cut":0,"cells_raw":0,"read":"whole","date_system":"1900"}

{"sheet":"Instructions","index":0,"n_rows":35,"n_cols":8,"rows_kept":35,"cut":false,"hidden":false,"merged":[[16,0,16,1],[14,2,14,5],[16,2,16,5],[10,7,10,11],[11,7,11,11],[13,0,13,5],[12,7,12,11],[13,7,13,11],[10,0,10,5],[12,0,12,5],[11,0,11,5],[4,0,4,5],[5,0,5,5],[5,7,7,11],[8,0,8,5],[8,7,9,11],[7,0,7,5],[9,0,9,5],[17,2,17,5],[15,2,15,5],[14,7,14,11],[15,7,15,11],[34,6,34,7],[21,7,21,11],[22,7,22,11],[23,7,23,11],[16,7,16,11],[17,7,18,11],[19,7,20,11],[28,6,28,7],[30,6,30,7],[31,6,31,7],[29,6,29,7]]}
[]
[]
[]
[]
["How the template works",null,null,null,null,null,null,"IMPORTANT NOTICE"]
["The purpose of this file is to quickly find the instruments and fields you need and provide examples of the functions to retrieve latest and/or historical pricing",null,null,null,null,null,null,"Access to Fastmarkets content and data is on a named user basis basis and is subject to the terms of your existing data licence agreement with us. No sharing of our content is permitted. A separate data licence agreement will be required if you need to copy, extract or share pricing data internally in its direct or derived format."]
["The template includes the following sheets:"]
["All Steel Raw Materials Symbols - this is a list of all available Symbols within the Steel Raw Materials data licence package"]
["Key Steel Raw Materials - this is a list of key symbols and available latest prices using the GetLatestPrices function within the Steel Raw Materials data licence package",null,null,null,null,null,null,"Unauthorised redistribution of the information including the printing, scanning or forwarding of this file constitutes a violation of copyright law."]
["My List - Latest Prices - this tab retrieves fields and latest physical & monthly average prices enabling you to copy & paste symbols from the above tabs to populate a custom list of favourite symbols"]
["My List - Average Prices - this tab retrieves fields and latest weekly, monthly & yearly average prices enabling you to copy & paste symbols from the above tabs to populate a custom list of favourite symbols",null,null,null,null,null,null,"Your easy solutions?"]
["My List - Convert Currency_UOM - this tab converts latest physical & monthly average prices to the currency or unit of measure of your choice, enabling you to copy & paste symbols from the above tabs to populate a custom list of favourite symbols",null,null,null,null,null,null,"1. Redistribution licenses"]
["Historical Data - single price - this tab retrieves historical price data for a specific date & historical data for a single symbol and allows you to convert the currency and/or unit of measure. There is an example of an Excel chart linked to the data, select your start & end date for the chart",null,null,null,null,null,null,"We'll discuss how we can assist you in optimising Fastmarkets content and data internally."]
[null,null,null,null,null,null,null,"2. A Fastmarkets corporate account"]
["Version Number:","Steel Raw Materials v1.3.07","Click below to access Fastmarkets Pricing Methodologies:",null,null,null,null,"When a number your colleagues need access to Fastmarkets we offer flexible, tailored access to Fastmarkets for everyone who needs it."]
["Date:","2022-01-24","https://www.fastmarkets.com/about-us/methodology",null,null,null,null,"A company account, may be the most cost effective solution for multiple usage across your organisation."]
["GET FURTHER HELP",null,"Click here for Fastmarkets Excel Add-In Support website:",null,null,null,null,"3. Fastmarkets price feeds"]
["Customer Success Team:","customersuccess@fastmarkets.com ","https://www.fastmarkets.com/support/customer-support-homepage/excel-add-in-support",null,null,null,null,"Get Fastmarkets pricing data integrated within your internal ETRM/Workflow or alternatively get delivered directly to your spreadsheet for enterprise-wide consumption."]
["EMEA","Tel: +44 20 3855 5581"]
["Asia Pacific","Tel: +65 31 633 458",null,null,null,null,null,"Contact us today to discuss a hassle-free, customised programme that addresses your individual needs and fully complies with copyright guidelines:"]
["Americas","Tel: +1 708 329 2641"]
["Client Services Team (access/orders)","client.services@fastmarkets.com",null,null,null,null,null,"Corporate Accounts Team"]
["Sales Team:","hello@fastmarkets.com",null,null,null,null,null,"hello@fastmarkets.com"]
[null,null,null,null,null,null,null,"Direct line: +44 (0) 20 7779 8260"]
[]
[]
["Formula","Result","Symbol Input","Price Calculation Type","Field input","Date Inputs","Formatting Inputs"]
["=GetInstruments","Retrieve all permissioned symbols & reference fields","Leave blank","N/A","N/A","N/A"]
["=GetInstrumentFields()","Returns all available fields for a given symbol and it's Price Calculation Type (physical prices or averages)","Cell reference\nType manually","Cell reference\nType manually e.g \"MonthlyAverage\"","N/A","N/A","\"V\" = Vertical\n\"H\" = Horizontal"]
["=GetPriceCalculationTypes","Returns Price Calculation Type for a chosen symbol (e.g. physical price vs averages)\n","Cell reference\nType manually","N/A","N/A","N/A","\"V\" = Vertical\n\"H\" = Horizontal"]
["=GetAvailableCurrencyConversion()","Returns the available currency conversions for a chosen symbol","Cell reference\nType manually","N/A","N/A","N/A","\"V\" = Vertical\n\"H\" = Horizontal"]
["=GetAvailableUnitOfMeasureConversion()","Returns the available unit of measure conversions for a chosen symbol","Cell reference\nType manually","N/A","N/A","N/A","\"V\" = Vertical\n\"H\" = Horizontal"]
["=GetLatestPrice","Returns latest price for chosen symbols, Price Calculation Type and fields","Cell reference\nType manually","Cell reference\nType manually e.g \"MonthlyAverage\"","Cell reference\nType manually"]
["=GetPrice","Returns price data for a chosen symbol, Price Calculation Type & field on a selected date","Cell reference\nType manually","Cell reference\nType manually e.g \"MonthlyAverage\"","Cell reference\nType manually","Cell reference\nType manually"]
["=GetPriceHistory","Returns price data for a chosen symbol, Price Calculation Type & fields between selected dates","Cell reference\nType manually","Cell reference\nType manually e.g \"MonthlyAverage\"","Cell reference specfic fields\nType manually specific fields\nLeave blank for all","Start & End Date:\nCell reference\nType manually","\"V\" = Vertical\n\"H\" = Horizontal\n\"D\" = Descending (latest at top)\n\"A\" = Ascending (oldest at top)\n\"ValueOnly\" - FillSettings parameter - returns values for assessment dates only\n\"Null\" - FillSettings parameter - returns all weekdays with values for assessment dates, blank otherwise\n\"CarryForward\" - FillSettings parameter - \"carries forward\" or repeats values on non-assessment dates"]

{"sheet":"All Steel Raw Materials Symbols","index":1,"n_rows":50,"n_cols":11,"rows_kept":50,"cut":false,"hidden":false,"merged":[]}
[]
[]
[]
[]
["Symbol","Description","Currency","UnitofMeasure","Incoterm","Frequency","Source","Commodity","Product","PriceType","Status"]
["Iron Ore"]
["MB-IRO-0015","Iron ore 58% Fe fines, cfr Qingdao, $/tonne","USD","Dry metric ton","Cost, insurance and freight","Daily","MB Iron Ore Index","Iron ore","Iron ore fines","Index","Active"]
["MB-IRO-0016","Iron ore 58% Fe fines high-grade premium, cfr Qingdao, $/tonne","USD","Dry metric ton","Cost, insurance and freight","Daily","MB Iron Ore Index","Iron ore","Iron ore fines","Index","Active"]
["MB-IRO-0017","Iron ore 58% Fe fines high-grade premium index, cfr Qingdao, $/tonne","USD","Dry metric ton","Cost, insurance and freight","Daily","MB Iron Ore Index","Iron ore","Iron ore fines","Index","Active"]
["MB-IRO-0011","Iron ore 62% Fe fines, fot Qingdao, yuan/wet tonne","CNY","Wet Tonne","Free on truck","Daily","Metal Bulletin    ","Iron ore","Iron Ore 62% Fe sinter fines","Index","Active"]
["MB-IRO-0022","Iron ore 62% Fe fines, fot Qingdao, $/tonne conversion","USD","Dry metric ton","Free on truck","Daily","MB Iron Ore Index","Iron ore","Iron ore fines","Index","Active"]
["MB-IRO-0010","Iron ore 63% Fe Australia-origin lump ore premium, cfr Qingdao, US cents/dmtu","USd","Dry metric ton unit","Cost and freight","Daily","Metal Bulletin    ","Iron ore","Iron Ore 63% Fe lump","Index","Active"]
["MB-IRO-0012","Iron ore 65% Fe blast furnace pellet, cfr Qingdao, $/tonne","USD","Tonne","Cost and freight","Weekly","Metal Bulletin    ","Iron ore","Iron Ore 65% Fe blast furnace pellet","Index","Active"]
["MB-IRO-0009","Iron ore 65% Fe Brazil-origin fines, cfr Qingdao, $/tonne","USD","Tonne","Cost and freight","Daily","Metal Bulletin    ","Iron ore","Iron Ore 65% Fe sinter fines","Index","Active"]
["MB-IRO-0013","Iron ore 66% Fe concentrate, cfr Qingdao, $/tonne","USD","Tonne","Cost and freight","Weekly","MB Iron Ore Index","Iron ore","Iron Ore concentrate 66% Fe","Index","Active"]
["MB-IRO-0021","Iron ore 62% Fe fines, % Al2O3 VIU, cfr Qingdao, $/tonne","USD","Dry metric ton","Cost, insurance and freight","Weekly","MB Iron Ore Index","Iron ore","Iron ore fines","Index","Active"]
["MB-IRO-0018","Iron ore 62% Fe fines, % Fe VIU, cfr Qingdao, $/tonne","USD","Dry metric ton","Cost, insurance and freight","Weekly","MB Iron Ore Index","Iron ore","Iron ore fines","Index","Active"]
["MB-IRO-0020","Iron ore 62% Fe fines, % Si VIU, cfr Qingdao, $/tonne","USD","Dry metric ton","Cost, insurance and freight","Weekly","MB Iron Ore Index","Iron ore","Iron ore fines","Index","Active"]
["MB-IRO-0024","Iron ore 62% Fe fines, 0.01% P VIU, cfr Qingdao, $/tonne","USd","Dry metric ton","Cost, insurance and freight","Weekly","MB Iron Ore Index","Iron ore","Iron ore fines","Index","Active"]
["MB-IRO-0019","Iron ore 65% Fe fines, % Fe VIU, cfr Qingdao $/tonne","USD","Dry metric ton","Cost, insurance and freight","Weekly","MB Iron Ore Index","Iron ore","Iron ore fines","Index","Active"]
["MB-IRO-0077","Iron ore DR-grade pellet premium, Middle East reference, $/tonne","USD","Dry metric ton","Cost and freight","Monthly","MB Iron Ore Index","Iron ore","Iron ore pellet DR Grade","Index","Active"]
["MB-IRO-0144","Iron ore 62% Fe low alumina fines, cfr Qingdao, $/dmtu","USD","Dry metric ton","Cost and freight","Daily","Metal Bulletin    ","Iron ore","Iron Ore 62% Fe sinter fines","Index","Active"]
["MB-IRO-0008","Iron ore 62% Fe fines, cfr Qingdao, $/tonne","USD","Tonne","Cost and freight","Daily","MB Iron Ore Index","Iron ore","Iron Ore 62% Fe sinter fines","Index","Active"]
["MB-IRO-0177","Iron ore pellet premium over 65% Fe fines, cfr China, $/tonne","USD","Tonne","Cost and freight","Weekly","MB Iron Ore Index","Iron ore","Iron ore pellets","Index","Active"]
["Metallurgical Coal"]
["MB-COA-0002","Hard coking coal, cfr Jingtang, $/dmtu","USD","Dry metric ton","Cost, insurance and freight","Daily","Metal Bulletin    ","Coal","Hard Coking Coal","Index","Active"]
["MB-COA-0004","Hard coking coal, fob DBCT, $/dmtu","USD","Dry metric ton","Free on board","Daily","Metal Bulletin    ","Coal","Hard Coking Coal","Index","Active"]
["MB-COA-0001","Hard coking coal domestic China spot market, Shanxi-origin, delivered Tangshan, yuan/tonne","CNY","Tonne","Delivered at place","Weekly","Metal Bulletin    ","Coal","Hard Coking Coal","Price","Active"]
["MB-COA-0006","Coke 65% CSR, fob China, $/tonne ","USD","Tonne","Free on board","Weekly","Metal Bulletin    ","Coal","CSR Coke","Price","Active"]
["MB-COA-0005","Premium hard coking coal, cfr Jingtang, $/dmtu","USD","Dry metric ton","Cost, insurance and freight","Daily","Metal Bulletin    ","Coal","Hard Coking Coal","Index","Active"]
["MB-COA-0003","Premium hard coking coal, fob DBCT, $/dmtu ","USD","Dry metric ton","Free on board","Daily","Metal Bulletin    ","Coal","Hard Coking Coal","Index","Active"]
["MB-COA-0007","PCI low-vol, cfr Jingtang, $/dmtu ","USD","Dry metric ton","Cost and freight","Daily","Metal Bulletin    ","Coal","Pulverized coal injection (PCI)","Index","Active"]
["MB-COA-0008","PCI low-vol, fob DBCT, $/dmtu ","USD","Dry metric ton","Free on board","Daily","Metal Bulletin    ","Coal","Pulverized coal injection (PCI)","Index","Active"]
["Metallics"]
["MB-IRO-0014","Pig iron import, cif Italy, $/tonne ","USD","Tonne","Cost, insurance and freight","Weekly","Metal Bulletin    ","Iron ore","Pig iron","Price","Active"]
["MB-FE-0003","Hot-briquetted iron, fob New Orleans, $/tonne","USD","Tonne","Free on board","Weekly","Scrap Price Bulletin","Iron","Hot briquetted iron","Price","Active"]
["MB-IRO-0023","Direct reduced iron domestic, exw India, rupees/tonne","INR","Tonne","Ex works","Weekly","Metal Bulletin    ","Iron ore","Iron ore fines","Price","Active"]
["MB-IRO-0006","Pig iron export, fob Ponta da Madeira, Brazil, $/tonne ","USD","Tonne","Free on board","Weekly","Metal Bulletin    ","Iron ore","Pig iron","Price","Active"]
["MB-IRO-0005","Pig iron export, fob Vitorio/Rio, Brazil, $/tonne ","USD","Tonne","Free on board","Weekly","Metal Bulletin    ","Iron ore","Pig iron","Price","Active"]
["MB-IRO-0079","Pig iron basic grade, Ukraine/Russia, fob New Orleans, $/tonne","USD","Tonne","Free on board","Weekly","Scrap Price Bulletin","Iron ore","Pig iron","Price","Active"]
["MB-IRO-0004","Pig iron import, cfr Gulf of Mexico, US, $/tonne ","USD","Tonne","Cost and freight","Weekly","Metal Bulletin    ","Iron ore","Pig iron","Price","Active"]
["MB-FE-0002","Hot-briquetted iron export, fob main port Venezuela, $/tonne ","USD","Tonne","Free on board","Weekly","Metal Bulletin    ","Iron","Hot briquetted iron","Price","Active"]
["MB-FE-0004","Hot-briquetted iron, cfr Italian ports, $/tonne","USD","Tonne","Cost and freight","Weekly","Metal Bulletin    ","Iron","Hot briquetted iron","Price","Active"]
["MB-IRO-0078","Pig iron basic grade, Brazil, fob New Orleans, $/tonne","USD","Tonne","Free on board","Weekly","Scrap Price Bulletin","Iron ore","Pig iron","Price","Active"]
["MB-FEN-0004","Pig iron foundry grade, Brazil, fob New Orleans, $/tonne","USD","Tonne","Free on board","Weekly","Scrap Price Bulletin","Ferro-nickel","Nickel pig iron high grade content 10-15%","Price","Active"]
["MB-FEN-0001","Nickel pig iron, high-grade NPI content 10-15%, contract, ddp China, yuan/nickel unit price",{"$f":"_xll.GetLatestPrice($A46,,C$5)","v":"CNY"},{"$f":"_xll.GetLatestPrice($A46,,D$5)","v":"NickelUnit"},{"$f":"_xll.GetLatestPrice($A46,,E$5)","v":"Delivered duty paid"},{"$f":"_xll.GetLatestPrice($A46,,F$5)","v":"Weekly"},{"$f":"_xll.GetLatestPrice($A46,,G$5)","v":"Metal Bulletin"},{"$f":"_xll.GetLatestPrice($A46,,H$5)","v":"Ferro-nickel"},{"$f":"_xll.GetLatestPrice($A46,,I$5)","v":"Nickel pig iron high grade content 10-15%"},{"$f":"_xll.GetLatestPrice($A46,,J$5)","v":"Price"},{"$f":"_xll.GetLatestPrice($A46,,K$5)","v":"Active"}]
["MB-FEN-0002","Nickel pig iron, high-grade NPI content 10-15%, spot, ddp China, yuan/nickel unit price",{"$f":"_xll.GetLatestPrice($A47,,C$5)","v":"CNY"},{"$f":"_xll.GetLatestPrice($A47,,D$5)","v":"NickelUnit"},{"$f":"_xll.GetLatestPrice($A47,,E$5)","v":"Delivered duty paid"},{"$f":"_xll.GetLatestPrice($A47,,F$5)","v":"Weekly"},{"$f":"_xll.GetLatestPrice($A47,,G$5)","v":"Metal Bulletin"},{"$f":"_xll.GetLatestPrice($A47,,H$5)","v":"Ferro-nickel"},{"$f":"_xll.GetLatestPrice($A47,,I$5)","v":"Nickel pig iron high grade content 10-15%"},{"$f":"_xll.GetLatestPrice($A47,,J$5)","v":"Price"},{"$f":"_xll.GetLatestPrice($A47,,K$5)","v":"Active"}]
["MB-IRO-0001","Pig iron export, fob main port Baltic Sea, CIS, $/tonne ","USD","Tonne","Free on board","Weekly","Metal Bulletin    ","Iron ore","Pig iron","Price","Active"]
["MB-IRO-0002","Pig iron export, fob main port Black Sea, CIS, $/tonne ","USD","Tonne","Free on board","Weekly","Metal Bulletin    ","Iron ore","Pig iron","Price","Active"]
["MB-IRO-0178","Pig iron, import, cfr China, $/tonne","US Dollar","Tonne","Every second week","Metal Bulletin","Active","Iron ore","Pig iron","Price","Active"]

{"sheet":"Key Steel Raw Materials","index":2,"n_rows":16,"n_cols":19,"rows_kept":16,"cut":false,"hidden":false,"merged":[[5,0,5,1],[0,2,2,18],[3,2,3,13],[3,14,3,18]]}
[null,null,"KEY STEEL RAW MATERIALS - PHYSICAL & AVERAGE PRICES"]
[]
[]
[null,null,"Actual Assessments",null,null,null,null,null,null,null,null,null,null,null,"Monthly Averages"]
["Symbol","Description","Low","High","Mid","LowChange","MidChange","HighChange","AssessmentDate","Currency","Unitofmeasure","Correction","Frequency","PricingRationale","Period","Low","High","Mid","AssessmentDate"]
["Key Steel Raw Materials "]
["MB-IRO-0015","Iron Ore 58% Fe delivered to China, normalized to Qingdao US $ per tonne",{"$f":"_xll.GetLatestPrice($A7,,C$5)","v":65.040000000000006},{"$f":"_xll.GetLatestPrice($A7,,D$5)","v":65.040000000000006},{"$f":"_xll.GetLatestPrice($A7,,E$5)","v":65.040000000000006},{"$f":"_xll.GetLatestPrice($A7,,F$5)","v":-3.52},{"$f":"_xll.GetLatestPrice($A7,,G$5)","v":-3.52},{"$f":"_xll.GetLatestPrice($A7,,H$5)","v":-3.52},{"$f":"_xll.GetLatestPrice($A7,,I$5)","v":"2021-10-29T18:23:21"},{"$f":"_xll.GetLatestPrice($A7,,J$5)","v":"USD"},{"$f":"_xll.GetLatestPrice($A7,,K$5)","v":"Tonne"},{"$f":"_xll.GetLatestPrice($A7,,L$5)","v":false},{"$f":"_xll.GetLatestPrice($A7,,M$5)","v":"Daily"},{"$f":"_xll.GetLatestPrice($A7,,N$5)","v":""},{"$f":"_xll.GetLatestPrice($A7,\"MonthlyAverage\",O$5)","v":"Oct 2021"},{"$f":"_xll.GetLatestPrice($A7,\"MonthlyAverage\",P$5)","v":77.06},{"$f":"_xll.GetLatestPrice($A7,\"MonthlyAverage\",Q$5)","v":77.06},{"$f":"_xll.GetLatestPrice($A7,\"MonthlyAverage\",R$5)","v":77.06},{"$f":"_xll.GetLatestPrice($A7,\"MonthlyAverage\",S$5)","v":"2021-10-29T19:30:59"}]
["MB-IRO-0017","Iron Ore 58%Fe High Grade Premium Index US $ per tonne CFR Qingdao",{"$f":"_xll.GetLatestPrice($A8,,C$5)","v":78.540000000000006},{"$f":"_xll.GetLatestPrice($A8,,D$5)","v":78.540000000000006},{"$f":"_xll.GetLatestPrice($A8,,E$5)","v":78.540000000000006},{"$f":"_xll.GetLatestPrice($A8,,F$5)","v":-4.5199999999999996},{"$f":"_xll.GetLatestPrice($A8,,G$5)","v":-4.5199999999999996},{"$f":"_xll.GetLatestPrice($A8,,H$5)","v":-4.5199999999999996},{"$f":"_xll.GetLatestPrice($A8,,I$5)","v":"2021-10-29T18:23:21"},{"$f":"_xll.GetLatestPrice($A8,,J$5)","v":"USD"},{"$f":"_xll.GetLatestPrice($A8,,K$5)","v":"Tonne"},{"$f":"_xll.GetLatestPrice($A8,,L$5)","v":false},{"$f":"_xll.GetLatestPrice($A8,,M$5)","v":"Daily"},{"$f":"_xll.GetLatestPrice($A8,,N$5)","v":""},{"$f":"_xll.GetLatestPrice($A8,\"MonthlyAverage\",O$5)","v":"Oct 2021"},{"$f":"_xll.GetLatestPrice($A8,\"MonthlyAverage\",P$5)","v":92.15},{"$f":"_xll.GetLatestPrice($A8,\"MonthlyAverage\",Q$5)","v":92.15},{"$f":"_xll.GetLatestPrice($A8,\"MonthlyAverage\",R$5)","v":92.15},{"$f":"_xll.GetLatestPrice($A8,\"MonthlyAverage\",S$5)","v":"2021-10-29T19:30:59"}]
["MB-IRO-0022","Iron Ore 62% Fe sinter fines, FOT main Chinese ports, US $ per tonne",{"$f":"_xll.GetLatestPrice($A9,,C$5)","v":115.12},{"$f":"_xll.GetLatestPrice($A9,,D$5)","v":115.12},{"$f":"_xll.GetLatestPrice($A9,,E$5)","v":115.12},{"$f":"_xll.GetLatestPrice($A9,,F$5)","v":-3.17},{"$f":"_xll.GetLatestPrice($A9,,G$5)","v":-3.17},{"$f":"_xll.GetLatestPrice($A9,,H$5)","v":-3.17},{"$f":"_xll.GetLatestPrice($A9,,I$5)","v":"2021-10-29T18:30:00"},{"$f":"_xll.GetLatestPrice($A9,,J$5)","v":"USD"},{"$f":"_xll.GetLatestPrice($A9,,K$5)","v":"Tonne"},{"$f":"_xll.GetLatestPrice($A9,,L$5)","v":false},{"$f":"_xll.GetLatestPrice($A9,,M$5)","v":"Daily"},{"$f":"_xll.GetLatestPrice($A9,,N$5)","v":""},{"$f":"_xll.GetLatestPrice($A9,\"MonthlyAverage\",O$5)","v":"Oct 2021"},{"$f":"_xll.GetLatestPrice($A9,\"MonthlyAverage\",P$5)","v":126.26},{"$f":"_xll.GetLatestPrice($A9,\"MonthlyAverage\",Q$5)","v":126.26},{"$f":"_xll.GetLatestPrice($A9,\"MonthlyAverage\",R$5)","v":126.26},{"$f":"_xll.GetLatestPrice($A9,\"MonthlyAverage\",S$5)","v":"2021-10-29T19:30:59"}]
["MB-IRO-0012","Iron Ore 65% Fe blast furnace pellet CFR Qingdao basis US $ per tonne",{"$f":"_xll.GetLatestPrice($A10,,C$5)","v":182.04},{"$f":"_xll.GetLatestPrice($A10,,D$5)","v":182.04},{"$f":"_xll.GetLatestPrice($A10,,E$5)","v":182.04},{"$f":"_xll.GetLatestPrice($A10,,F$5)","v":-9.3699999999999992},{"$f":"_xll.GetLatestPrice($A10,,G$5)","v":-9.3699999999999992},{"$f":"_xll.GetLatestPrice($A10,,H$5)","v":-9.3699999999999992},{"$f":"_xll.GetLatestPrice($A10,,I$5)","v":"2021-10-29T18:32:32"},{"$f":"_xll.GetLatestPrice($A10,,J$5)","v":"USD"},{"$f":"_xll.GetLatestPrice($A10,,K$5)","v":"Tonne"},{"$f":"_xll.GetLatestPrice($A10,,L$5)","v":false},{"$f":"_xll.GetLatestPrice($A10,,M$5)","v":"Weekly"},{"$f":"_xll.GetLatestPrice($A10,,N$5)","v":""},{"$f":"_xll.GetLatestPrice($A10,\"MonthlyAverage\",O$5)","v":"Oct 2021"},{"$f":"_xll.GetLatestPrice($A10,\"MonthlyAverage\",P$5)","v":186.24},{"$f":"_xll.GetLatestPrice($A10,\"MonthlyAverage\",Q$5)","v":186.24},{"$f":"_xll.GetLatestPrice($A10,\"MonthlyAverage\",R$5)","v":186.24},{"$f":"_xll.GetLatestPrice($A10,\"MonthlyAverage\",S$5)","v":"2021-10-29T19:30:59"}]
["MB-IRO-0009","Iron Ore 65% Fe Brazilian origin high grade sinter fines CFR Qingdao US $ per tonne",{"$f":"_xll.GetLatestPrice($A11,,C$5)","v":127.1},{"$f":"_xll.GetLatestPrice($A11,,D$5)","v":127.1},{"$f":"_xll.GetLatestPrice($A11,,E$5)","v":127.1},{"$f":"_xll.GetLatestPrice($A11,,F$5)","v":-4.2},{"$f":"_xll.GetLatestPrice($A11,,G$5)","v":-4.2},{"$f":"_xll.GetLatestPrice($A11,,H$5)","v":-4.2},{"$f":"_xll.GetLatestPrice($A11,,I$5)","v":"2021-10-29T18:23:21"},{"$f":"_xll.GetLatestPrice($A11,,J$5)","v":"USD"},{"$f":"_xll.GetLatestPrice($A11,,K$5)","v":"Tonne"},{"$f":"_xll.GetLatestPrice($A11,,L$5)","v":false},{"$f":"_xll.GetLatestPrice($A11,,M$5)","v":"Daily"},{"$f":"_xll.GetLatestPrice($A11,,N$5)","v":"Fastmarkets’ index for iron ore 65% Fe Brazil-origin fines, cfr Qingdao fell by $4.2 per tonne from the previous day. The price movement was based on the visible market activity detailed below, which was included in the index calculation according to the published methodology. For the calculation of the 65% Fe index, judgement was applied to carry over data in today’s indices due to low liquidity in the 24-hour pricing window, corresponding with published fallback measures. No data was discarded in the calculation of these indices. Any data received under Data Submitter Agreements or subject to a confidentiality request will not be published.\n\nMarket participants' indications for MBIOI65 Index (65%Fe basis):\nIron Ore Carajas: $123.2 - $132 per tonne CFR China;\n\nTrades/offers/Bids heard in the market\nNo visible activity."},{"$f":"_xll.GetLatestPrice($A11,\"MonthlyAverage\",O$5)","v":"Oct 2021"},{"$f":"_xll.GetLatestPrice($A11,\"MonthlyAverage\",P$5)","v":143.24},{"$f":"_xll.GetLatestPrice($A11,\"MonthlyAverage\",Q$5)","v":143.24},{"$f":"_xll.GetLatestPrice($A11,\"MonthlyAverage\",R$5)","v":143.24},{"$f":"_xll.GetLatestPrice($A11,\"MonthlyAverage\",S$5)","v":"2021-10-29T19:30:59"}]
["MB-IRO-0013","Iron Ore 66% Fe concentrate CFR Qingdao US $ per tonne",{"$f":"_xll.GetLatestPrice($A12,,C$5)","v":137.47999999999999},{"$f":"_xll.GetLatestPrice($A12,,D$5)","v":137.47999999999999},{"$f":"_xll.GetLatestPrice($A12,,E$5)","v":137.47999999999999},{"$f":"_xll.GetLatestPrice($A12,,F$5)","v":-10.1},{"$f":"_xll.GetLatestPrice($A12,,G$5)","v":-10.1},{"$f":"_xll.GetLatestPrice($A12,,H$5)","v":-10.1},{"$f":"_xll.GetLatestPrice($A12,,I$5)","v":"2021-10-29T18:32:32"},{"$f":"_xll.GetLatestPrice($A12,,J$5)","v":"USD"},{"$f":"_xll.GetLatestPrice($A12,,K$5)","v":"Tonne"},{"$f":"_xll.GetLatestPrice($A12,,L$5)","v":false},{"$f":"_xll.GetLatestPrice($A12,,M$5)","v":"Weekly"},{"$f":"_xll.GetLatestPrice($A12,,N$5)","v":"Fastmarkets’ index for iron ore 66% Fe concentrate, cfr Qingdao fell by $10.1 per tonne from the previous calculation. The price movement was based on the visible market activity detailed below, which was included in the index calculation according to the published methodology.  For the calculation of this index, judgement was applied to carry over data in today’s index due to low liquidity in the 7-day pricing window, corresponding with published fallback measures. No data was discarded in the calculation of this index.  Any data received under Data Submitter Agreements or subject to a confidentiality request will not be published.\n\nTrades/offers/bids heard in the market\nSpot market, 163,500 tonnes of 70.12% Fe Peruvian pellet feed, offered at the average of a 65% Fe index and its Fe value-in-use for the month of the notice of readiness (NOR) at the port of discharge, plus a premium of $13 per tonne, late-November arrival.\n\nSpot market, 110,000 tonnes of 66.32% Fe Ukrainian concentrate, offered at the average of a 65% Fe index for the month of the NOR at the port of discharge, adjusted for Fe content, plus a premium $3.50 per tonne, bill of lading dated October 26.\n\nSpot market, 62.5% Fe PMC concentrate, offered at the average of a 62% Fe index for the month of the NOR at the port of discharge, adjusted for Fe content, plus a premium of $3 per tonne, November loading.\n\nMarket participants' indications for MBIOI-CO Index (66%Fe basis):\nMetinvest Concentrate: $137.3 - $138.3 per tonne CFR China;\nKarara Concentrate: $131.1 - $131.1 per tonne CFR China;\nCitic Pacific Concentrate: $129 - $130.1 per tonne CFR China;\nMinas Rio Concentrate: $137.7 - $140.5 per tonne CFR China;"},{"$f":"_xll.GetLatestPrice($A12,\"MonthlyAverage\",O$5)","v":"Oct 2021"},{"$f":"_xll.GetLatestPrice($A12,\"MonthlyAverage\",P$5)","v":141.88},{"$f":"_xll.GetLatestPrice($A12,\"MonthlyAverage\",Q$5)","v":141.88},{"$f":"_xll.GetLatestPrice($A12,\"MonthlyAverage\",R$5)","v":141.88},{"$f":"_xll.GetLatestPrice($A12,\"MonthlyAverage\",S$5)","v":"2021-10-29T19:30:59"}]
["MB-IRO-0008","MBIO Index Iron Ore 62% Fe fines CFR Qingdao US $/tonne",{"$f":"_xll.GetLatestPrice($A13,,C$5)","v":107.28},{"$f":"_xll.GetLatestPrice($A13,,D$5)","v":107.28},{"$f":"_xll.GetLatestPrice($A13,,E$5)","v":107.28},{"$f":"_xll.GetLatestPrice($A13,,F$5)","v":-5.37},{"$f":"_xll.GetLatestPrice($A13,,G$5)","v":-5.37},{"$f":"_xll.GetLatestPrice($A13,,H$5)","v":-5.37},{"$f":"_xll.GetLatestPrice($A13,,I$5)","v":"2021-10-29T18:23:21"},{"$f":"_xll.GetLatestPrice($A13,,J$5)","v":"USD"},{"$f":"_xll.GetLatestPrice($A13,,K$5)","v":"Tonne"},{"$f":"_xll.GetLatestPrice($A13,,L$5)","v":false},{"$f":"_xll.GetLatestPrice($A13,,M$5)","v":"Daily"},{"$f":"_xll.GetLatestPrice($A13,,N$5)","v":"Fastmarkets’ index for iron ore 62% Fe fines, cfr Qingdao fell by $5.37 per tonne from the previous day. The price movement was based on the visible market activity detailed below, which was included in the index calculation according to the published methodology.  For the calculation of the 62% Fe index, judgement was applied to carry over data in today’s indices due to low liquidity in the 24-hour pricing window, corresponding with published fallback measures. No data was discarded in the calculation of these indices. Any data received under Data Submitter Agreements or subject to a confidentiality request will not be published.\n\nMarket participants' indications for MBIOI62 Index (62%Fe basis):\nPilbara Blend fines: $104.44 - $110.5 per tonne CFR China;\nBrazilian Blend fines: $106.44 - $113 per tonne CFR China;\nNewman fines: $105.83 - $108.97 per tonne CFR China;\nMac fines: $93.75 - $99.42 per tonne CFR China;\nJimblebar fines: $82.95 - $93.26 per tonne CFR China;\n\nTrades/offers/Bids heard in the market\nBeijing Iron Ore Trading Center, 80,000 tonnes of 60.8% Fe Mining Area C fines, offered at $93.30 per tonne cfr China, laycan November 26-December 5."},{"$f":"_xll.GetLatestPrice($A13,\"MonthlyAverage\",O$5)","v":"Oct 2021"},{"$f":"_xll.GetLatestPrice($A13,\"MonthlyAverage\",P$5)","v":120.76},{"$f":"_xll.GetLatestPrice($A13,\"MonthlyAverage\",Q$5)","v":120.76},{"$f":"_xll.GetLatestPrice($A13,\"MonthlyAverage\",R$5)","v":120.76},{"$f":"_xll.GetLatestPrice($A13,\"MonthlyAverage\",S$5)","v":"2021-10-29T19:30:59"}]
["MB-COA-0005","Premium Hard Coking Coal Index $ per dry metric tonne cfr Jingtang",{"$f":"_xll.GetLatestPrice($A14,,C$5)","v":608.12},{"$f":"_xll.GetLatestPrice($A14,,D$5)","v":608.12},{"$f":"_xll.GetLatestPrice($A14,,E$5)","v":608.12},{"$f":"_xll.GetLatestPrice($A14,,F$5)","v":0},{"$f":"_xll.GetLatestPrice($A14,,G$5)","v":0},{"$f":"_xll.GetLatestPrice($A14,,H$5)","v":0},{"$f":"_xll.GetLatestPrice($A14,,I$5)","v":"2021-10-29T18:30:00"},{"$f":"_xll.GetLatestPrice($A14,,J$5)","v":"USD"},{"$f":"_xll.GetLatestPrice($A14,,K$5)","v":"DryMetricTon"},{"$f":"_xll.GetLatestPrice($A14,,L$5)","v":false},{"$f":"_xll.GetLatestPrice($A14,,M$5)","v":"Daily"},{"$f":"_xll.GetLatestPrice($A14,,N$5)","v":""},{"$f":"_xll.GetLatestPrice($A14,\"MonthlyAverage\",O$5)","v":"Oct 2021"},{"$f":"_xll.GetLatestPrice($A14,\"MonthlyAverage\",P$5)","v":609.59},{"$f":"_xll.GetLatestPrice($A14,\"MonthlyAverage\",Q$5)","v":609.59},{"$f":"_xll.GetLatestPrice($A14,\"MonthlyAverage\",R$5)","v":609.59},{"$f":"_xll.GetLatestPrice($A14,\"MonthlyAverage\",S$5)","v":"2021-10-29T19:33:20"}]
["MB-COA-0003","Premium Hard Coking Coal Index $ per dry metric tonne fob DBCT",{"$f":"_xll.GetLatestPrice($A15,,C$5)","v":404.59},{"$f":"_xll.GetLatestPrice($A15,,D$5)","v":404.59},{"$f":"_xll.GetLatestPrice($A15,,E$5)","v":404.59},{"$f":"_xll.GetLatestPrice($A15,,F$5)","v":-0.52},{"$f":"_xll.GetLatestPrice($A15,,G$5)","v":-0.52},{"$f":"_xll.GetLatestPrice($A15,,H$5)","v":-0.52},{"$f":"_xll.GetLatestPrice($A15,,I$5)","v":"2021-10-29T18:30:00"},{"$f":"_xll.GetLatestPrice($A15,,J$5)","v":"USD"},{"$f":"_xll.GetLatestPrice($A15,,K$5)","v":"DryMetricTon"},{"$f":"_xll.GetLatestPrice($A15,,L$5)","v":false},{"$f":"_xll.GetLatestPrice($A15,,M$5)","v":"Daily"},{"$f":"_xll.GetLatestPrice($A15,,N$5)","v":""},{"$f":"_xll.GetLatestPrice($A15,\"MonthlyAverage\",O$5)","v":"Oct 2021"},{"$f":"_xll.GetLatestPrice($A15,\"MonthlyAverage\",P$5)","v":401.26},{"$f":"_xll.GetLatestPrice($A15,\"MonthlyAverage\",Q$5)","v":401.26},{"$f":"_xll.GetLatestPrice($A15,\"MonthlyAverage\",R$5)","v":401.26},{"$f":"_xll.GetLatestPrice($A15,\"MonthlyAverage\",S$5)","v":"2021-10-29T19:33:20"}]
["MB-IRO-0144","Iron Ore 62% Fe Iron Ores Fines Low Alumina index CFR Qingdao US $ per dry metric tonne",{"$f":"_xll.GetLatestPrice($A16,,C$5)","v":109.57},{"$f":"_xll.GetLatestPrice($A16,,D$5)","v":109.57},{"$f":"_xll.GetLatestPrice($A16,,E$5)","v":109.57},{"$f":"_xll.GetLatestPrice($A16,,F$5)","v":-5.68},{"$f":"_xll.GetLatestPrice($A16,,G$5)","v":-5.68},{"$f":"_xll.GetLatestPrice($A16,,H$5)","v":-5.68},{"$f":"_xll.GetLatestPrice($A16,,I$5)","v":"2021-10-29T18:23:21"},{"$f":"_xll.GetLatestPrice($A16,,J$5)","v":"USD"},{"$f":"_xll.GetLatestPrice($A16,,K$5)","v":"Tonne"},{"$f":"_xll.GetLatestPrice($A16,,L$5)","v":false},{"$f":"_xll.GetLatestPrice($A16,,M$5)","v":"Daily"},{"$f":"_xll.GetLatestPrice($A16,,N$5)","v":"Fastmarkets’ index for iron ore 62% Fe Low Alumina fines, cfr Qingdao fell by $5.68 per tonne from the previous day. The price movement was based on the visible market activity detailed below, which was included in the index calculation according to the published methodology. No data was discarded in the calculation of these indices. Any data received under Data Submitter Agreements or subject to a confidentiality request will not be published.\n\nMarket participants' indications for MBIOI62-LA Index (62%Fe basis):\nBrazilian Blend fines: $106.44 - $113 per tonne CFR China;\n\nTrades/offers/Bids heard in the market\nNo visible activity."},{"$f":"_xll.GetLatestPrice($A16,\"MonthlyAverage\",O$5)","v":"Oct 2021"},{"$f":"_xll.GetLatestPrice($A16,\"MonthlyAverage\",P$5)","v":122.87},{"$f":"_xll.GetLatestPrice($A16,\"MonthlyAverage\",Q$5)","v":122.87},{"$f":"_xll.GetLatestPrice($A16,\"MonthlyAverage\",R$5)","v":122.87},{"$f":"_xll.GetLatestPrice($A16,\"MonthlyAverage\",S$5)","v":"2021-10-29T19:30:59"}]

{"sheet":"My List - Latest Prices","index":3,"n_rows":12,"n_cols":22,"rows_kept":12,"cut":false,"hidden":false,"merged":[[5,2,5,8],[5,9,5,13],[5,14,5,21]]}
[]
[]
[]
[]
["STEP 1:","Type or Copy/Paste Symbols from other tabs into Column A to create your custom list of physical prices and averages:"]
["STEP 2:","Copy the formulae in columns B-U down your list","Actual Assessments",null,null,null,null,null,null,"Monthly Averages",null,null,null,null,"Reference Data"]
["Symbol","Description","AssessmentDate","Low","Mid","High","LowChange","MidChange","HighChange","AssessmentDate","Period","Low","Mid","High","Source","Currency","UnitOfMeasure","Incoterm","Correction","AppraisalPrice","Location","PricingRationale"]
["MB-IRO-0012",{"$f":"_xll.GetLatestPrice($A8,\"Actuals\",B$7)","v":"Iron ore 65% Fe blast furnace pellet, cfr Qingdao, $/tonne"},{"$f":"_xll.GetLatestPrice($A8,\"Actuals\",C$7)","v":"2021-10-29T18:32:32"},{"$f":"_xll.GetLatestPrice($A8,\"Actuals\",D$7)","v":182.04},{"$f":"_xll.GetLatestPrice($A8,\"Actuals\",E$7)","v":182.04},{"$f":"_xll.GetLatestPrice($A8,\"Actuals\",F$7)","v":182.04},{"$f":"_xll.GetLatestPrice($A8,\"Actuals\",G$7)","v":-9.3699999999999992},{"$f":"_xll.GetLatestPrice($A8,\"Actuals\",H$7)","v":-9.3699999999999992},{"$f":"_xll.GetLatestPrice($A8,\"Actuals\",I$7)","v":-9.3699999999999992},{"$f":"_xll.GetLatestPrice($A8,\"MonthlyAverage\",J$7)","v":"2021-10-29T19:30:59"},{"$f":"_xll.GetLatestPrice($A8,\"MonthlyAverage\",K$7)","v":"Oct 2021"},{"$f":"_xll.GetLatestPrice($A8,\"MonthlyAverage\",L$7)","v":186.24},{"$f":"_xll.GetLatestPrice($A8,\"MonthlyAverage\",M$7)","v":186.24},{"$f":"_xll.GetLatestPrice($A8,\"MonthlyAverage\",N$7)","v":186.24},{"$f":"_xll.GetLatestPrice($A8,\"Actuals\",O$7)","v":"MB Iron Ore Index"},{"$f":"_xll.GetLatestPrice($A8,\"Actuals\",P$7)","v":"USD"},{"$f":"_xll.GetLatestPrice($A8,\"Actuals\",Q$7)","v":"Tonne"},{"$f":"_xll.GetLatestPrice($A8,\"Actuals\",R$7)","v":"Cost and freight"},{"$f":"_xll.GetLatestPrice($A8,\"Actuals\",S$7)","v":false},{"$f":"_xll.GetLatestPrice($A8,\"Actuals\",T$7)","v":"AppraisalPrice is deprecated. Please use PreliminaryPrice instead"},{"$f":"_xll.GetLatestPrice($A8,\"Actuals\",U$7)","v":"China"},{"$f":"_xll.GetLatestPrice($A8,\"Actuals\",V$7)","v":""}]
["MB-IRO-0009",{"$f":"_xll.GetLatestPrice($A9,\"Actuals\",B$7)","v":"Iron ore 65% Fe Brazil-origin fines, cfr Qingdao, $/tonne"},{"$f":"_xll.GetLatestPrice($A9,\"Actuals\",C$7)","v":"2021-10-29T18:23:21"},{"$f":"_xll.GetLatestPrice($A9,\"Actuals\",D$7)","v":127.1},{"$f":"_xll.GetLatestPrice($A9,\"Actuals\",E$7)","v":127.1},{"$f":"_xll.GetLatestPrice($A9,\"Actuals\",F$7)","v":127.1},{"$f":"_xll.GetLatestPrice($A9,\"Actuals\",G$7)","v":-4.2},{"$f":"_xll.GetLatestPrice($A9,\"Actuals\",H$7)","v":-4.2},{"$f":"_xll.GetLatestPrice($A9,\"Actuals\",I$7)","v":-4.2},{"$f":"_xll.GetLatestPrice($A9,\"MonthlyAverage\",J$7)","v":"2021-10-29T19:30:59"},{"$f":"_xll.GetLatestPrice($A9,\"MonthlyAverage\",K$7)","v":"Oct 2021"},{"$f":"_xll.GetLatestPrice($A9,\"MonthlyAverage\",L$7)","v":143.24},{"$f":"_xll.GetLatestPrice($A9,\"MonthlyAverage\",M$7)","v":143.24},{"$f":"_xll.GetLatestPrice($A9,\"MonthlyAverage\",N$7)","v":143.24},{"$f":"_xll.GetLatestPrice($A9,\"Actuals\",O$7)","v":"MB Iron Ore Index"},{"$f":"_xll.GetLatestPrice($A9,\"Actuals\",P$7)","v":"USD"},{"$f":"_xll.GetLatestPrice($A9,\"Actuals\",Q$7)","v":"Tonne"},{"$f":"_xll.GetLatestPrice($A9,\"Actuals\",R$7)","v":"Cost and freight"},{"$f":"_xll.GetLatestPrice($A9,\"Actuals\",S$7)","v":false},{"$f":"_xll.GetLatestPrice($A9,\"Actuals\",T$7)","v":"AppraisalPrice is deprecated. Please use PreliminaryPrice instead"},{"$f":"_xll.GetLatestPrice($A9,\"Actuals\",U$7)","v":"China"},{"$f":"_xll.GetLatestPrice($A9,\"Actuals\",V$7)","v":"Fastmarkets’ index for iron ore 65% Fe Brazil-origin fines, cfr Qingdao fell by $4.2 per tonne from the previous day. The price movement was based on the visible market activity detailed below, which was included in the index calculation according to the published methodology. For the calculation of the 65% Fe index, judgement was applied to carry over data in today’s indices due to low liquidity in the 24-hour pricing window, corresponding with published fallback measures. No data was discarded in the calculation of these indices. Any data received under Data Submitter Agreements or subject to a confidentiality request will not be published.\n\nMarket participants' indications for MBIOI65 Index (65%Fe basis):\nIron Ore Carajas: $123.2 - $132 per tonne CFR China;\n\nTrades/offers/Bids heard in the market\nNo visible activity."}]
["MB-COA-0005",{"$f":"_xll.GetLatestPrice($A10,\"Actuals\",B$7)","v":"Premium hard coking coal, cfr Jingtang, $/dmt"},{"$f":"_xll.GetLatestPrice($A10,\"Actuals\",C$7)","v":"2021-10-29T18:30:00"},{"$f":"_xll.GetLatestPrice($A10,\"Actuals\",D$7)","v":608.12},{"$f":"_xll.GetLatestPrice($A10,\"Actuals\",E$7)","v":608.12},{"$f":"_xll.GetLatestPrice($A10,\"Actuals\",F$7)","v":608.12},{"$f":"_xll.GetLatestPrice($A10,\"Actuals\",G$7)","v":0},{"$f":"_xll.GetLatestPrice($A10,\"Actuals\",H$7)","v":0},{"$f":"_xll.GetLatestPrice($A10,\"Actuals\",I$7)","v":0},{"$f":"_xll.GetLatestPrice($A10,\"MonthlyAverage\",J$7)","v":"2021-10-29T19:33:20"},{"$f":"_xll.GetLatestPrice($A10,\"MonthlyAverage\",K$7)","v":"Oct 2021"},{"$f":"_xll.GetLatestPrice($A10,\"MonthlyAverage\",L$7)","v":609.59},{"$f":"_xll.GetLatestPrice($A10,\"MonthlyAverage\",M$7)","v":609.59},{"$f":"_xll.GetLatestPrice($A10,\"MonthlyAverage\",N$7)","v":609.59},{"$f":"_xll.GetLatestPrice($A10,\"Actuals\",O$7)","v":"Metal Bulletin"},{"$f":"_xll.GetLatestPrice($A10,\"Actuals\",P$7)","v":"USD"},{"$f":"_xll.GetLatestPrice($A10,\"Actuals\",Q$7)","v":"DryMetricTon"},{"$f":"_xll.GetLatestPrice($A10,\"Actuals\",R$7)","v":"Cost, insurance and freight"},{"$f":"_xll.GetLatestPrice($A10,\"Actuals\",S$7)","v":false},{"$f":"_xll.GetLatestPrice($A10,\"Actuals\",T$7)","v":"AppraisalPrice is deprecated. Please use PreliminaryPrice instead"},{"$f":"_xll.GetLatestPrice($A10,\"Actuals\",U$7)","v":"Jingtang"},{"$f":"_xll.GetLatestPrice($A10,\"Actuals\",V$7)","v":""}]
["MB-COA-0005",{"$f":"_xll.GetLatestPrice($A11,\"Actuals\",B$7)","v":"Premium hard coking coal, cfr Jingtang, $/dmt"},{"$f":"_xll.GetLatestPrice($A11,\"Actuals\",C$7)","v":"2021-10-29T18:30:00"},{"$f":"_xll.GetLatestPrice($A11,\"Actuals\",D$7)","v":608.12},{"$f":"_xll.GetLatestPrice($A11,\"Actuals\",E$7)","v":608.12},{"$f":"_xll.GetLatestPrice($A11,\"Actuals\",F$7)","v":608.12},{"$f":"_xll.GetLatestPrice($A11,\"Actuals\",G$7)","v":0},{"$f":"_xll.GetLatestPrice($A11,\"Actuals\",H$7)","v":0},{"$f":"_xll.GetLatestPrice($A11,\"Actuals\",I$7)","v":0},{"$f":"_xll.GetLatestPrice($A11,\"MonthlyAverage\",J$7)","v":"2021-10-29T19:33:20"},{"$f":"_xll.GetLatestPrice($A11,\"MonthlyAverage\",K$7)","v":"Oct 2021"},{"$f":"_xll.GetLatestPrice($A11,\"MonthlyAverage\",L$7)","v":609.59},{"$f":"_xll.GetLatestPrice($A11,\"MonthlyAverage\",M$7)","v":609.59},{"$f":"_xll.GetLatestPrice($A11,\"MonthlyAverage\",N$7)","v":609.59},{"$f":"_xll.GetLatestPrice($A11,\"Actuals\",O$7)","v":"Metal Bulletin"},{"$f":"_xll.GetLatestPrice($A11,\"Actuals\",P$7)","v":"USD"},{"$f":"_xll.GetLatestPrice($A11,\"Actuals\",Q$7)","v":"DryMetricTon"},{"$f":"_xll.GetLatestPrice($A11,\"Actuals\",R$7)","v":"Cost, insurance and freight"},{"$f":"_xll.GetLatestPrice($A11,\"Actuals\",S$7)","v":false},{"$f":"_xll.GetLatestPrice($A11,\"Actuals\",T$7)","v":"AppraisalPrice is deprecated. Please use PreliminaryPrice instead"},{"$f":"_xll.GetLatestPrice($A11,\"Actuals\",U$7)","v":"Jingtang"},{"$f":"_xll.GetLatestPrice($A11,\"Actuals\",V$7)","v":""}]
["MB-COA-0003",{"$f":"_xll.GetLatestPrice($A12,\"Actuals\",B$7)","v":"Premium hard coking coal, fob DBCT, $/dmt"},{"$f":"_xll.GetLatestPrice($A12,\"Actuals\",C$7)","v":"2021-10-29T18:30:00"},{"$f":"_xll.GetLatestPrice($A12,\"Actuals\",D$7)","v":404.59},{"$f":"_xll.GetLatestPrice($A12,\"Actuals\",E$7)","v":404.59},{"$f":"_xll.GetLatestPrice($A12,\"Actuals\",F$7)","v":404.59},{"$f":"_xll.GetLatestPrice($A12,\"Actuals\",G$7)","v":-0.52},{"$f":"_xll.GetLatestPrice($A12,\"Actuals\",H$7)","v":-0.52},{"$f":"_xll.GetLatestPrice($A12,\"Actuals\",I$7)","v":-0.52},{"$f":"_xll.GetLatestPrice($A12,\"MonthlyAverage\",J$7)","v":"2021-10-29T19:33:20"},{"$f":"_xll.GetLatestPrice($A12,\"MonthlyAverage\",K$7)","v":"Oct 2021"},{"$f":"_xll.GetLatestPrice($A12,\"MonthlyAverage\",L$7)","v":401.26},{"$f":"_xll.GetLatestPrice($A12,\"MonthlyAverage\",M$7)","v":401.26},{"$f":"_xll.GetLatestPrice($A12,\"MonthlyAverage\",N$7)","v":401.26},{"$f":"_xll.GetLatestPrice($A12,\"Actuals\",O$7)","v":"Metal Bulletin"},{"$f":"_xll.GetLatestPrice($A12,\"Actuals\",P$7)","v":"USD"},{"$f":"_xll.GetLatestPrice($A12,\"Actuals\",Q$7)","v":"DryMetricTon"},{"$f":"_xll.GetLatestPrice($A12,\"Actuals\",R$7)","v":"Free on board"},{"$f":"_xll.GetLatestPrice($A12,\"Actuals\",S$7)","v":false},{"$f":"_xll.GetLatestPrice($A12,\"Actuals\",T$7)","v":"AppraisalPrice is deprecated. Please use PreliminaryPrice instead"},{"$f":"_xll.GetLatestPrice($A12,\"Actuals\",U$7)","v":"Australia"},{"$f":"_xll.GetLatestPrice($A12,\"Actuals\",V$7)","v":""}]

{"sheet":"My List - Average Prices","index":4,"n_rows":12,"n_cols":17,"rows_kept":12,"cut":false,"hidden":false,"merged":[[5,2,5,6],[5,7,5,11],[5,12,5,16]]}
[]
[]
[]
[]
["STEP 1:","Type or Copy/Paste Symbols from other tabs into Column A to create your custom list of average prices:"]
["STEP 2:","Copy the formulae in columns B-U down your list","Weekly Averages",null,null,null,null,"Monthly Averages",null,null,null,null,"Yearly Averages"]
["Symbol","Description","AssessmentDate","Period","Low","Mid","High","AssessmentDate","Period","Low","Mid","High","AssessmentDate","Period","Low","Mid","High"]
["MB-IRO-0012",{"$f":"_xll.GetLatestPrice($A8,\"Actuals\",B$7)","v":"Iron ore 65% Fe blast furnace pellet, cfr Qingdao, $/tonne"},{"$f":"_xll.GetLatestPrice($A8,\"WeeklyAverage\",C$7)","v":"2021-09-17T23:59:59"},{"$f":"_xll.GetLatestPrice($A8,\"WeeklyAverage\",D$7)","v":"11-17 Sep 2021"},{"$f":"_xll.GetLatestPrice($A8,\"WeeklyAverage\",E$7)","v":173.03},{"$f":"_xll.GetLatestPrice($A8,\"WeeklyAverage\",F$7)","v":173.03},{"$f":"_xll.GetLatestPrice($A8,\"WeeklyAverage\",G$7)","v":173.03},{"$f":"_xll.GetLatestPrice($A8,\"MonthlyAverage\",H$7)","v":"2021-10-29T19:30:59"},{"$f":"_xll.GetLatestPrice($A8,\"MonthlyAverage\",I$7)","v":"Oct 2021"},{"$f":"_xll.GetLatestPrice($A8,\"MonthlyAverage\",J$7)","v":186.24},{"$f":"_xll.GetLatestPrice($A8,\"MonthlyAverage\",K$7)","v":186.24},{"$f":"_xll.GetLatestPrice($A8,\"MonthlyAverage\",L$7)","v":186.24},{"$f":"_xll.GetLatestPrice($A8,\"YearlyAverage\",M$7)","v":"2020-12-31T12:00:00"},{"$f":"_xll.GetLatestPrice($A8,\"YearlyAverage\",N$7)","v":"2020"},{"$f":"_xll.GetLatestPrice($A8,\"YearlyAverage\",O$7)","v":136.05000000000001},{"$f":"_xll.GetLatestPrice($A8,\"YearlyAverage\",P$7)","v":136.05000000000001},{"$f":"_xll.GetLatestPrice($A8,\"YearlyAverage\",Q$7)","v":136.05000000000001}]
["MB-IRO-0009",{"$f":"_xll.GetLatestPrice($A9,\"Actuals\",B$7)","v":"Iron ore 65% Fe Brazil-origin fines, cfr Qingdao, $/tonne"},{"$f":"_xll.GetLatestPrice($A9,\"WeeklyAverage\",C$7)","v":"2021-10-29T22:00:00"},{"$f":"_xll.GetLatestPrice($A9,\"WeeklyAverage\",D$7)","v":"23-29 Oct 2021"},{"$f":"_xll.GetLatestPrice($A9,\"WeeklyAverage\",E$7)","v":136.44},{"$f":"_xll.GetLatestPrice($A9,\"WeeklyAverage\",F$7)","v":136.44},{"$f":"_xll.GetLatestPrice($A9,\"WeeklyAverage\",G$7)","v":136.44},{"$f":"_xll.GetLatestPrice($A9,\"MonthlyAverage\",H$7)","v":"2021-10-29T19:30:59"},{"$f":"_xll.GetLatestPrice($A9,\"MonthlyAverage\",I$7)","v":"Oct 2021"},{"$f":"_xll.GetLatestPrice($A9,\"MonthlyAverage\",J$7)","v":143.24},{"$f":"_xll.GetLatestPrice($A9,\"MonthlyAverage\",K$7)","v":143.24},{"$f":"_xll.GetLatestPrice($A9,\"MonthlyAverage\",L$7)","v":143.24},{"$f":"_xll.GetLatestPrice($A9,\"YearlyAverage\",M$7)","v":"2020-12-31T12:00:00"},{"$f":"_xll.GetLatestPrice($A9,\"YearlyAverage\",N$7)","v":"2020"},{"$f":"_xll.GetLatestPrice($A9,\"YearlyAverage\",O$7)","v":122.31},{"$f":"_xll.GetLatestPrice($A9,\"YearlyAverage\",P$7)","v":122.31},{"$f":"_xll.GetLatestPrice($A9,\"YearlyAverage\",Q$7)","v":122.31}]
["MB-COA-0005",{"$f":"_xll.GetLatestPrice($A10,\"Actuals\",B$7)","v":"Premium hard coking coal, cfr Jingtang, $/dmt"},{"$f":"_xll.GetLatestPrice($A10,\"WeeklyAverage\",C$7)","v":"2021-10-29T22:00:00"},{"$f":"_xll.GetLatestPrice($A10,\"WeeklyAverage\",D$7)","v":"23-29 Oct 2021"},{"$f":"_xll.GetLatestPrice($A10,\"WeeklyAverage\",E$7)","v":612.04},{"$f":"_xll.GetLatestPrice($A10,\"WeeklyAverage\",F$7)","v":612.04},{"$f":"_xll.GetLatestPrice($A10,\"WeeklyAverage\",G$7)","v":612.04},{"$f":"_xll.GetLatestPrice($A10,\"MonthlyAverage\",H$7)","v":"2021-10-29T19:33:20"},{"$f":"_xll.GetLatestPrice($A10,\"MonthlyAverage\",I$7)","v":"Oct 2021"},{"$f":"_xll.GetLatestPrice($A10,\"MonthlyAverage\",J$7)","v":609.59},{"$f":"_xll.GetLatestPrice($A10,\"MonthlyAverage\",K$7)","v":609.59},{"$f":"_xll.GetLatestPrice($A10,\"MonthlyAverage\",L$7)","v":609.59},{"$f":"_xll.GetLatestPrice($A10,\"YearlyAverage\",M$7)","v":"2020-12-31T12:00:00"},{"$f":"_xll.GetLatestPrice($A10,\"YearlyAverage\",N$7)","v":"2020"},{"$f":"_xll.GetLatestPrice($A10,\"YearlyAverage\",O$7)","v":142.1},{"$f":"_xll.GetLatestPrice($A10,\"YearlyAverage\",P$7)","v":142.1},{"$f":"_xll.GetLatestPrice($A10,\"YearlyAverage\",Q$7)","v":142.1}]
["MB-COA-0005",{"$f":"_xll.GetLatestPrice($A11,\"Actuals\",B$7)","v":"Premium hard coking coal, cfr Jingtang, $/dmt"},{"$f":"_xll.GetLatestPrice($A11,\"WeeklyAverage\",C$7)","v":"2021-10-29T22:00:00"},{"$f":"_xll.GetLatestPrice($A11,\"WeeklyAverage\",D$7)","v":"23-29 Oct 2021"},{"$f":"_xll.GetLatestPrice($A11,\"WeeklyAverage\",E$7)","v":612.04},{"$f":"_xll.GetLatestPrice($A11,\"WeeklyAverage\",F$7)","v":612.04},{"$f":"_xll.GetLatestPrice($A11,\"WeeklyAverage\",G$7)","v":612.04},{"$f":"_xll.GetLatestPrice($A11,\"MonthlyAverage\",H$7)","v":"2021-10-29T19:33:20"},{"$f":"_xll.GetLatestPrice($A11,\"MonthlyAverage\",I$7)","v":"Oct 2021"},{"$f":"_xll.GetLatestPrice($A11,\"MonthlyAverage\",J$7)","v":609.59},{"$f":"_xll.GetLatestPrice($A11,\"MonthlyAverage\",K$7)","v":609.59},{"$f":"_xll.GetLatestPrice($A11,\"MonthlyAverage\",L$7)","v":609.59},{"$f":"_xll.GetLatestPrice($A11,\"YearlyAverage\",M$7)","v":"2020-12-31T12:00:00"},{"$f":"_xll.GetLatestPrice($A11,\"YearlyAverage\",N$7)","v":"2020"},{"$f":"_xll.GetLatestPrice($A11,\"YearlyAverage\",O$7)","v":142.1},{"$f":"_xll.GetLatestPrice($A11,\"YearlyAverage\",P$7)","v":142.1},{"$f":"_xll.GetLatestPrice($A11,\"YearlyAverage\",Q$7)","v":142.1}]
["MB-COA-0003",{"$f":"_xll.GetLatestPrice($A12,\"Actuals\",B$7)","v":"Premium hard coking coal, fob DBCT, $/dmt"},{"$f":"_xll.GetLatestPrice($A12,\"WeeklyAverage\",C$7)","v":"2021-10-29T22:00:00"},{"$f":"_xll.GetLatestPrice($A12,\"WeeklyAverage\",D$7)","v":"23-29 Oct 2021"},{"$f":"_xll.GetLatestPrice($A12,\"WeeklyAverage\",E$7)","v":401.85},{"$f":"_xll.GetLatestPrice($A12,\"WeeklyAverage\",F$7)","v":401.85},{"$f":"_xll.GetLatestPrice($A12,\"WeeklyAverage\",G$7)","v":401.85},{"$f":"_xll.GetLatestPrice($A12,\"MonthlyAverage\",H$7)","v":"2021-10-29T19:33:20"},{"$f":"_xll.GetLatestPrice($A12,\"MonthlyAverage\",I$7)","v":"Oct 2021"},{"$f":"_xll.GetLatestPrice($A12,\"MonthlyAverage\",J$7)","v":401.26},{"$f":"_xll.GetLatestPrice($A12,\"MonthlyAverage\",K$7)","v":401.26},{"$f":"_xll.GetLatestPrice($A12,\"MonthlyAverage\",L$7)","v":401.26},{"$f":"_xll.GetLatestPrice($A12,\"YearlyAverage\",M$7)","v":"2020-12-31T12:00:00"},{"$f":"_xll.GetLatestPrice($A12,\"YearlyAverage\",N$7)","v":"2020"},{"$f":"_xll.GetLatestPrice($A12,\"YearlyAverage\",O$7)","v":123.46},{"$f":"_xll.GetLatestPrice($A12,\"YearlyAverage\",P$7)","v":123.46},{"$f":"_xll.GetLatestPrice($A12,\"YearlyAverage\",Q$7)","v":123.46}]

{"sheet":"My List - Convert Currency_UOM","index":5,"n_rows":26,"n_cols":42,"rows_kept":26,"cut":false,"hidden":false,"merged":[[5,11,5,17],[5,20,5,25],[3,2,3,3],[3,4,3,5],[4,2,4,3],[4,4,4,5],[5,2,5,8],[5,9,5,10]]}
[]
[]
[]
["STEP 1:","Type or Copy/Paste Symbols from other tabs into Column A to create your custom list of physical prices and averages:","Select Currency:",null,"EUR - Euro dollar"]
["STEP 2:","Copy the formulae in columns B-U down your list","Select Unit of Measure:",null,"Pound"]
["STEP 3: ","Select Currency and/or Unit of Measure to convert prices to","Actual Assessments",null,null,null,null,null,null,null,null,"Monthly Averages",null,null,null,null,null,null,null,null,null,null,null,null,null,null,null,null,null,null,null,null,null,null,null,null,null,null,"Input for fuctions",null,null,"Input for fuctions"]
["Symbol","Description","AssessmentDate","Low","Mid","High","LowChange","MidChange","HighChange","Currency","UnitOfMeasure","AssessmentDate","Period","Low","Mid","High","Currency","UnitOfMeasure","Source","Currency","Assessed Unit of Measure","Incoterm","Correction","AppraisalPrice","Location","PricingRationale",null,null,null,null,null,null,null,null,null,null,null,"Label",{"$f":"VLOOKUP($E$4,AL8:AM27,2,FALSE)","v":"EUR"},"Label","UOM",{"$f":"VLOOKUP($E$5,AN8:AO27,2,FALSE)","v":"Pound"}]
["MB-IRO-0012",{"$f":"_xll.GetLatestPrice($A8,\"Actuals\",B$7)","v":"Iron ore 65% Fe blast furnace pellet, cfr Qingdao, $/tonne"},{"$f":"_xll.GetLatestPrice($A8,\"Actuals\",C$7,$AM$7,$AP$7)","v":"2021-10-29T18:32:32"},{"$f":"_xll.GetLatestPrice($A8,\"Actuals\",D$7,$AM$7,$AP$7)","v":7.1466109700000002E-2},{"$f":"_xll.GetLatestPrice($A8,\"Actuals\",E$7,$AM$7,$AP$7)","v":7.1466109700000002E-2},{"$f":"_xll.GetLatestPrice($A8,\"Actuals\",F$7,$AM$7,$AP$7)","v":7.1466109700000002E-2},{"$f":"_xll.GetLatestPrice($A8,\"Actuals\",G$7,$AM$7,$AP$7)","v":-3.0976782E-3},{"$f":"_xll.GetLatestPrice($A8,\"Actuals\",H$7,$AM$7,$AP$7)","v":0},{"$f":"_xll.GetLatestPrice($A8,\"Actuals\",I$7,$AM$7,$AP$7)","v":-3.0976782E-3},{"$f":"_xll.GetLatestPrice($A8,\"Actuals\",J$7,$AM$7,$AP$7)","v":"EUR"},{"$f":"_xll.GetLatestPrice($A8,\"Actuals\",K$7,$AM$7,$AP$7)","v":"Pound"},{"$f":"_xll.GetLatestPrice($A8,\"MonthlyAverage\",L$7,$AM$7,$E$5)","v":"2021-10-29T19:30:59"},{"$f":"_xll.GetLatestPrice($A8,\"MonthlyAverage\",M$7,$AM$7,$E$5)","v":"Oct 2021"},{"$f":"_xll.GetLatestPrice($A8,\"MonthlyAverage\",N$7,$AM$7,$E$5)","v":7.3114965200000007E-2},{"$f":"_xll.GetLatestPrice($A8,\"MonthlyAverage\",O$7,$AM$7,$E$5)","v":7.3114965200000007E-2},{"$f":"_xll.GetLatestPrice($A8,\"MonthlyAverage\",P$7,$AM$7,$E$5)","v":7.3114965200000007E-2},{"$f":"_xll.GetLatestPrice($A8,\"MonthlyAverage\",Q$7,$AM$7,$E$5)","v":"EUR"},{"$f":"_xll.GetLatestPrice($A8,\"MonthlyAverage\",R$7,$AM$7,$E$5)","v":"Pound"},{"$f":"_xll.GetLatestPrice($A8,\"Actuals\",S$7)","v":"MB Iron Ore Index"},{"$f":"_xll.GetLatestPrice($A8,\"Actuals\",T$7)","v":"USD"},{"$f":"_xll.GetLatestPrice($A8,\"Actuals\",\"UnitOfMeasure\")","v":"Tonne"},{"$f":"_xll.GetLatestPrice($A8,\"Actuals\",V$7)","v":"Cost and freight"},{"$f":"_xll.GetLatestPrice($A8,\"Actuals\",W$7)","v":false},{"$f":"_xll.GetLatestPrice($A8,\"Actuals\",X$7)","v":"AppraisalPrice is deprecated. Please use PreliminaryPrice instead"},{"$f":"_xll.GetLatestPrice($A8,\"Actuals\",Y$7)","v":"China"},{"$f":"_xll.GetLatestPrice($A8,\"Actuals\",Z$7)","v":""},null,null,null,null,null,null,null,null,null,null,null,"None",""]
["MB-IRO-0009",{"$f":"_xll.GetLatestPrice($A9,\"Actuals\",B$7)","v":"Iron ore 65% Fe Brazil-origin fines, cfr Qingdao, $/tonne"},{"$f":"_xll.GetLatestPrice($A9,\"Actuals\",C$7,$AM$7,$AP$7)","v":"2021-10-29T18:23:21"},{"$f":"_xll.GetLatestPrice($A9,\"Actuals\",D$7,$AM$7,$AP$7)","v":4.9897509E-2},{"$f":"_xll.GetLatestPrice($A9,\"Actuals\",E$7,$AM$7,$AP$7)","v":4.9897509E-2},{"$f":"_xll.GetLatestPrice($A9,\"Actuals\",F$7,$AM$7,$AP$7)","v":4.9897509E-2},{"$f":"_xll.GetLatestPrice($A9,\"Actuals\",G$7,$AM$7,$AP$7)","v":-1.0753246999999999E-3},{"$f":"_xll.GetLatestPrice($A9,\"Actuals\",H$7,$AM$7,$AP$7)","v":0},{"$f":"_xll.GetLatestPrice($A9,\"Actuals\",I$7,$AM$7,$AP$7)","v":-1.0753246999999999E-3},{"$f":"_xll.GetLatestPrice($A9,\"Actuals\",J$7,$AM$7,$AP$7)","v":"EUR"},{"$f":"_xll.GetLatestPrice($A9,\"Actuals\",K$7,$AM$7,$AP$7)","v":"Pound"},{"$f":"_xll.GetLatestPrice($A9,\"MonthlyAverage\",L$7,$AM$7,$E$5)","v":"2021-10-29T19:30:59"},{"$f":"_xll.GetLatestPrice($A9,\"MonthlyAverage\",M$7,$AM$7,$E$5)","v":"Oct 2021"},{"$f":"_xll.GetLatestPrice($A9,\"MonthlyAverage\",N$7,$AM$7,$E$5)","v":5.6233825199999997E-2},{"$f":"_xll.GetLatestPrice($A9,\"MonthlyAverage\",O$7,$AM$7,$E$5)","v":5.6233825199999997E-2},{"$f":"_xll.GetLatestPrice($A9,\"MonthlyAverage\",P$7,$AM$7,$E$5)","v":5.6233825199999997E-2},{"$f":"_xll.GetLatestPrice($A9,\"MonthlyAverage\",Q$7,$AM$7,$E$5)","v":"EUR"},{"$f":"_xll.GetLatestPrice($A9,\"MonthlyAverage\",R$7,$AM$7,$E$5)","v":"Pound"},{"$f":"_xll.GetLatestPrice($A9,\"Actuals\",S$7)","v":"MB Iron Ore Index"},{"$f":"_xll.GetLatestPrice($A9,\"Actuals\",T$7)","v":"USD"},{"$f":"_xll.GetLatestPrice($A9,\"Actuals\",\"UnitOfMeasure\")","v":"Tonne"},{"$f":"_xll.GetLatestPrice($A9,\"Actuals\",V$7)","v":"Cost and freight"},{"$f":"_xll.GetLatestPrice($A9,\"Actuals\",W$7)","v":false},{"$f":"_xll.GetLatestPrice($A9,\"Actuals\",X$7)","v":"AppraisalPrice is deprecated. Please use PreliminaryPrice instead"},{"$f":"_xll.GetLatestPrice($A9,\"Actuals\",Y$7)","v":"China"},{"$f":"_xll.GetLatestPrice($A9,\"Actuals\",Z$7)","v":"Fastmarkets’ index for iron ore 65% Fe Brazil-origin fines, cfr Qingdao fell by $4.2 per tonne from the previous day. The price movement was based on the visible market activity detailed below, which was included in the index calculation according to the published methodology. For the calculation of the 65% Fe index, judgement was applied to carry over data in today’s indices due to low liquidity in the 24-hour pricing window, corresponding with published fallback measures. No data was discarded in the calculation of these indices. Any data received under Data Submitter Agreements or subject to a confidentiality request will not be published.\n\nMarket participants' indications for MBIOI65 Index (65%Fe basis):\nIron Ore Carajas: $123.2 - $132 per tonne CFR China;\n\nTrades/offers/Bids heard in the market\nNo visible activity."},null,null,null,null,null,null,null,null,null,null,null,"AED - UAE Dirham",{"$f":"LEFT(AL9,3)","v":"AED"},"None",""]
[]
[]
[]
[null,null,null,null,null,null,null,null,null,null,null,null,null,null,null,null,null,null,null,null,null,null,null,null,null,null,null,null,null,null,null,null,null,null,null,null,null,"EGP - Egyptian Pound",{"$f":"LEFT(AL13,3)","v":"EGP"},"Gram","Gram"]
[null,null,null,null,null,null,null,null,null,null,null,null,null,null,null,null,null,null,null,null,null,null,null,null,null,null,null,null,null,null,null,null,null,null,null,null,null,"Eur - Euro cent","Eur","GrossTon","GrossTon"]
[null,null,null,null,null,null,null,null,null,null,null,null,null,null,null,null,null,null,null,null,null,null,null,null,null,null,null,null,null,null,null,null,null,null,null,null,null,"EUR - Euro dollar","EUR","Hundredweight","Hundredweight"]
[null,null,null,null,null,null,null,null,null,null,null,null,null,null,null,null,null,null,null,null,null,null,null,null,null,null,null,null,null,null,null,null,null,null,null,null,null,"GBP - British Pound","GBP","Kilogram","Kilogram"]
[null,null,null,null,null,null,null,null,null,null,null,null,null,null,null,null,null,null,null,null,null,null,null,null,null,null,null,null,null,null,null,null,null,null,null,null,null,"INR - Indian Rupee","INR","LongTon","LongTon"]
[null,null,null,null,null,null,null,null,null,null,null,null,null,null,null,null,null,null,null,null,null,null,null,null,null,null,null,null,null,null,null,null,null,null,null,null,null,"IRR - Iranian Real","IRR","NetTon","NetTon"]
[null,null,null,null,null,null,null,null,null,null,null,null,null,null,null,null,null,null,null,null,null,null,null,null,null,null,null,null,null,null,null,null,null,null,null,null,null,"PEN - Peruvian Nuevo Sol","PEN","NickelUnit","NickelUnit"]
[null,null,null,null,null,null,null,null,null,null,null,null,null,null,null,null,null,null,null,null,null,null,null,null,null,null,null,null,null,null,null,null,null,null,null,null,null,"PLN - Polish Zloty","PLN","Pound","Pound"]
[null,null,null,null,null,null,null,null,null,null,null,null,null,null,null,null,null,null,null,null,null,null,null,null,null,null,null,null,null,null,null,null,null,null,null,null,null,"RUB - Russian Ruble","RUB","ShortTon","ShortTon"]
[null,null,null,null,null,null,null,null,null,null,null,null,null,null,null,null,null,null,null,null,null,null,null,null,null,null,null,null,null,null,null,null,null,null,null,null,null,"TRY - Turkish Lira","TRY","ShortTonThousands","ShortTonThousands"]
[null,null,null,null,null,null,null,null,null,null,null,null,null,null,null,null,null,null,null,null,null,null,null,null,null,null,null,null,null,null,null,null,null,null,null,null,null,"UAH - Ukraine Hryvnia","UAH","Tonne","Tonne"]
[null,null,null,null,null,null,null,null,null,null,null,null,null,null,null,null,null,null,null,null,null,null,null,null,null,null,null,null,null,null,null,null,null,null,null,null,null,"Usd - US cent","Usd","TroyOunce","TroyOunce"]
[null,null,null,null,null,null,null,null,null,null,null,null,null,null,null,null,null,null,null,null,null,null,null,null,null,null,null,null,null,null,null,null,null,null,null,null,null,"USD -  US Dollar","USD","WetTonne","WetTonne"]
[null,null,null,null,null,null,null,null,null,null,null,null,null,null,null,null,null,null,null,null,null,null,null,null,null,null,null,null,null,null,null,null,null,null,null,null,null,"ZAR - South African Rand","ZAR"]

{"sheet":"Historical Data - Single Price","index":6,"n_rows":515,"n_cols":38,"rows_kept":515,"cut":false,"hidden":false,"merged":[[12,3,12,5],[16,29,16,37],[3,1,3,4],[5,1,5,4],[5,30,5,34],[9,0,9,7],[10,1,11,1],[10,2,11,2],[10,3,11,5],[10,6,11,6],[10,7,11,7]]}
[null,null,null,null,null,null,null,null,null,null,null,null,null,null,null,null,null,null,null,null,null,null,null,null,null,null,null,null,null,"Actuals"]
[null,null,null,null,null,null,null,null,null,null,null,null,null,null,null,null,null,null,null,null,null,null,null,null,null,null,null,null,null,"WeeklyAverage"]
[null,null,null,null,null,null,null,null,null,null,null,null,null,null,null,null,null,null,null,null,null,null,null,null,null,null,null,null,null,"WeeklyAverageFriThur"]
[null,"Price Reference Data",null,null,null,null,null,null,null,null,null,null,null,null,null,null,null,null,null,null,null,null,null,null,null,null,null,null,null,"MonthlyAverage","Chart Label logic",{"$f":"IF(AG4=\"\",B6,B6&\" - Converted to \"&$A$13)","v":"Iron ore 65% Fe blast furnace pellet, cfr Qingdao, $/tonne - Converted to "},{"$f":"ISBLANK(A13)","v":false}]
["Enter Symbol:","MB-IRO-0012",null,null,null,null,null,null,null,null,null,null,null,null,null,null,null,null,null,null,null,null,null,null,null,null,null,null,null,"YearlyAverage"]
["Description",{"$f":"_xll.GetLatestPrice($B$5,,$A6)","v":"Iron ore 65% Fe blast furnace pellet, cfr Qingdao, $/tonne"},null,null,null,null,null,null,null,null,null,null,null,null,null,null,null,null,null,null,null,null,null,null,null,null,null,null,null,null,"DO NOT REMOVE THIS BOX"]
["Currency",{"$f":"_xll.GetLatestPrice($B$5,,$A7)","v":"USD"},null,null,null,null,null,null,null,null,null,null,null,null,null,null,null,null,null,null,null,null,null,null,null,null,null,null,null,null,"Concatenated currency/UOM",null,{"$f":"AE15&\"/\"&AH15","v":"/"}]
["UnitOfMeasure",{"$f":"_xll.GetLatestPrice($B$5,,$A8)","v":"Tonne"},null,null,null,null,null,null,null,null,null,null,null,null,null,null,null,null,null,null,null,null,null,null,null,null,null,null,null,"ValueOnly"]
[null,null,null,null,null,null,null,null,null,null,null,null,null,null,null,null,null,null,null,null,null,null,null,null,null,null,null,null,null,null,"Conversion applied logic?",null,{"$f":"IF(AND(AH11=TRUE,AH12=TRUE),TRUE,FALSE)","v":false},{"$f":"IF(AG9=TRUE,AG7,IF(AH11=TRUE,AH15,IF(AH12=TRUE,AE15,\"\")))","v":""}]
["CLICK INTO PURPLE CELLS TO CONVERT THE CURRENCY AND UNIT OF MEASURE FOR THE DATES REQUIRED"]
[null,"Type Start Date below:","Type End Date below:","Select Actual Physical Price or Average - click menu below",null,null,"Click below to select Currency to convert","Click below to select Unit of Measure to convert",null,null,null,null,null,null,null,null,null,null,null,null,null,null,null,null,null,null,null,null,null,null,"UOM converted",null,null,{"$f":"H13<>\"None\"","v":false}]
["CONVERSION APPLIED:",null,null,null,null,null,null,null,null,null,null,null,null,null,null,null,null,null,null,null,null,null,null,null,null,null,null,null,null,null,"Currency Converted",null,null,{"$f":"G13<>\"None\"","v":false}]
[{"$f":"AH9","v":""},"2012-01-01",null,"Actuals",null,null,"None","None",null,null,null,null,null,null,null,null,null,null,null,null,null,null,null,null,null,null,null,null,null,null,"Currency input parameter",null,null,"UOM input parameter"]
[null,"High","Low","Mid","AssessmentDate"]
[{"$f":"_xll.GetPriceHistory($B$5,$D$13,$B$13,$C$13,,,,$AE$15,$AH$15,\"Date\",\"AssessmentDate\",\"Period\",\"Low\",\"Mid\",\"High\",\"Currency\",\"UnitOfMeasure\")","v":"Date"},"AssessmentDate","Period","Low","Mid","High","Currency","UnitOfMeasure",null,null,null,null,null,null,null,null,null,null,null,null,null,null,null,null,null,null,null,null,null,null,{"$f":"VLOOKUP($G$13,$AG$20:$AH$37,2,FALSE)","v":""},null,null,{"$f":"VLOOKUP($H$13,$AK$19:$AL$35,2,FALSE)","v":""}]
["2021-10-29","2021-10-29T18:32:32","29 Oct 2021",182.04,182.04,182.04,"USD","Tonne"]
["2021-10-22","2021-10-22T18:27:22","22 Oct 2021",191.41,191.41,191.41,"USD","Tonne",null,null,null,null,null,null,null,null,null,null,null,null,null,null,null,null,null,null,null,null,null,"DO NOT REMOVE THIS BOX"]
["2021-10-15","2021-10-15T18:35:53","15 Oct 2021",194.98,194.98,194.98,"USD","Tonne",null,null,null,null,null,null,null,null,null,null,null,null,null,null,null,null,null,null,null,null,null,null,null,null,null,"Currency input parameter","All UOM","UOM Label","For Drop down","Get Available Units of Measure"]
["2021-10-08","2021-10-08T18:44:53","08 Oct 2021",182.76,182.76,182.76,"USD","Tonne",null,null,null,null,null,null,null,null,null,null,null,null,null,null,null,null,null,null,null,null,null,"All Currencies","Currency Labels",null,null,"","None","None",{"$f":"AJ19","v":"None"},""]
["2021-10-01","2021-10-01T18:23:34","01 Oct 2021",180.03,180.03,180.03,"USD","Tonne",null,null,null,null,null,null,null,null,null,null,null,null,null,null,null,null,null,null,null,null,null,"","None",null,"None","","DryMetricTon","DryMetricTon",{"$f":"VLOOKUP($AL20,$AI$19:$AJ$35,2,FALSE)","v":"DryMetricTonUnit"},{"$f":"_xll.GetAvailableUnitofMeasureConversions($B$5,\"V\")","v":"DryMetricTonUnit"}]
["2021-09-24","2021-09-24T18:54:53","24 Sep 2021",164.11,164.11,164.11,"USD","Tonne",null,null,null,null,null,null,null,null,null,null,null,null,null,null,null,null,null,null,null,null,null,"AED","AED - UAE Dirham",{"$f":"_xll.GetAvailableCurrencyConversions($B$5,\"v\")","v":"AED"},{"$f":"INDEX($AE$21:$AE$38,MATCH(TRUE,EXACT(AF21,$AD$21:$AD$38),0))","v":"AED - UAE Dirham"},{"$f":"_xll.GetAvailableCurrencyConversions($B$5,\"V\")","v":"AED"},"DryMetricTonUnit","DryMetricTonUnit",{"$f":"VLOOKUP($AL21,$AI$19:$AJ$35,2,FALSE)","v":"Flask"},"Flask"]
["2021-09-17","2021-09-17T10:50:59","17 Sep 2021",173.03,173.03,173.03,"USD","Tonne",null,null,null,null,null,null,null,null,null,null,null,null,null,null,null,null,null,null,null,null,null,"ARS","ARS - Argentine Peso","ARS",{"$f":"INDEX($AE$21:$AE$38,MATCH(TRUE,EXACT(AF22,$AD$21:$AD$38),0))","v":"ARS - Argentine Peso"},"ARS","Flask","Flask","Gram","Gram"]
["2021-09-10","2021-09-10T10:53:02","10 Sep 2021",187.91,187.91,187.91,"USD","Tonne",null,null,null,null,null,null,null,null,null,null,null,null,null,null,null,null,null,null,null,null,null,"BRL","BRL - Brazilian Real","AUD",{"$f":"INDEX($AE$21:$AE$38,MATCH(TRUE,EXACT(AF23,$AD$21:$AD$38),0))","v":{"$error":"#N/A"}},"AUD","Gram","Gram","GrossTon","GrossTon"]
["2021-09-03","2021-09-03T10:34:47","03 Sep 2021",202.33,202.33,202.33,"USD","Tonne",null,null,null,null,null,null,null,null,null,null,null,null,null,null,null,null,null,null,null,null,null,"CNY","CNY - Chinese Yuan Renminbi","BRL",{"$f":"INDEX($AE$21:$AE$38,MATCH(TRUE,EXACT(AF24,$AD$21:$AD$38),0))","v":"BRL - Brazilian Real"},"BRL","GrossTon","GrossTon","Hundredweight","Hundredweight"]
["2021-08-27","2021-08-27T10:51:16","27 Aug 2021",198.14,198.14,198.14,"USD","Tonne",null,null,null,null,null,null,null,null,null,null,null,null,null,null,null,null,null,null,null,null,null,"EGP","EGP - Egyptian Pound","CAd",{"$f":"INDEX($AE$21:$AE$38,MATCH(TRUE,EXACT(AF25,$AD$21:$AD$38),0))","v":{"$error":"#N/A"}},"CAd","Hundredweight","Hundredweight","Kilogram","Kilogram"]
["2021-08-20","2021-08-20T10:43:33","20 Aug 2021",207.74,207.74,207.74,"USD","Tonne",null,null,null,null,null,null,null,null,null,null,null,null,null,null,null,null,null,null,null,null,null,"EUr","Eur - Euro cent","CAD",{"$f":"INDEX($AE$21:$AE$38,MATCH(TRUE,EXACT(AF26,$AD$21:$AD$38),0))","v":{"$error":"#N/A"}},"CAD","Kilogram","Kilogram","LongTon","LongTon"]
["2021-08-13","2021-08-13T10:39:49","13 Aug 2021",228.36,228.36,228.36,"USD","Tonne",null,null,null,null,null,null,null,null,null,null,null,null,null,null,null,null,null,null,null,null,null,"EUR","EUR - Euro dollar","CNY",{"$f":"INDEX($AE$21:$AE$38,MATCH(TRUE,EXACT(AF27,$AD$21:$AD$38),0))","v":"CNY - Chinese Yuan Renminbi"},"CNY","LongTon","LongTon","NetTon","NetTon"]
["2021-08-06","2021-08-06T10:45:04","06 Aug 2021",251.27,251.27,251.27,"USD","Tonne",null,null,null,null,null,null,null,null,null,null,null,null,null,null,null,null,null,null,null,null,null,"GBP","GBP - British Pound","EGP",{"$f":"INDEX($AE$21:$AE$38,MATCH(TRUE,EXACT(AF28,$AD$21:$AD$38),0))","v":"EGP - Egyptian Pound"},"EGP","NetTon","NetTon","Pound","Pound"]
["2021-07-30","2021-07-30T10:41:28","30 Jul 2021",272.72000000000003,272.72000000000003,272.72000000000003,"USD","Tonne",null,null,null,null,null,null,null,null,null,null,null,null,null,null,null,null,null,null,null,null,null,"INR","INR - Indian Rupee","EUr",{"$f":"INDEX($AE$21:$AE$38,MATCH(TRUE,EXACT(AF29,$AD$21:$AD$38),0))","v":"Eur - Euro cent"},"EUr","NickelUnit","NickelUnit","ShortTon","ShortTon"]
["2021-07-23","2021-07-23T10:49:45","23 Jul 2021",295.27,295.27,295.27,"USD","Tonne",null,null,null,null,null,null,null,null,null,null,null,null,null,null,null,null,null,null,null,null,null,"IRR","IRR - Iranian Real","EUR",{"$f":"INDEX($AE$21:$AE$38,MATCH(TRUE,EXACT(AF30,$AD$21:$AD$38),0))","v":"EUR - Euro dollar"},"EUR","Pound","Pound","TroyOunce","TroyOunce"]
["2021-07-16","2021-07-16T10:42:14","16 Jul 2021",304.23,304.23,304.23,"USD","Tonne",null,null,null,null,null,null,null,null,null,null,null,null,null,null,null,null,null,null,null,null,null,"PEN","PEN - Peruvian Nuevo Sol","GBp",{"$f":"INDEX($AE$21:$AE$38,MATCH(TRUE,EXACT(AF31,$AD$21:$AD$38),0))","v":{"$error":"#N/A"}},"GBp","ShortTon","ShortTon"]
["2021-07-09","2021-07-09T10:42:03","09 Jul 2021",303.70999999999998,303.70999999999998,303.70999999999998,"USD","Tonne",null,null,null,null,null,null,null,null,null,null,null,null,null,null,null,null,null,null,null,null,null,"PLN","PLN - Polish Zloty","GBP",{"$f":"INDEX($AE$21:$AE$38,MATCH(TRUE,EXACT(AF32,$AD$21:$AD$38),0))","v":"GBP - British Pound"},"GBP","ShortTonThousands","ShortTonThousands"]
["2021-07-02","2021-07-02T10:40:12","02 Jul 2021",301.20999999999998,301.20999999999998,301.20999999999998,"USD","Tonne",null,null,null,null,null,null,null,null,null,null,null,null,null,null,null,null,null,null,null,null,null,"RUB","RUB - Russian Ruble","INR",{"$f":"INDEX($AE$21:$AE$38,MATCH(TRUE,EXACT(AF33,$AD$21:$AD$38),0))","v":"INR - Indian Rupee"},"INR","Tonne","Tonne"]
["2021-06-25","2021-06-25T10:45:28","25 Jun 2021",300.81,300.81,300.81,"USD","Tonne",null,null,null,null,null,null,null,null,null,null,null,null,null,null,null,null,null,null,null,null,null,"TRY","TRY - Turkish Lira","IRR",{"$f":"INDEX($AE$21:$AE$38,MATCH(TRUE,EXACT(AF34,$AD$21:$AD$38),0))","v":"IRR - Iranian Real"},"IRR","TroyOunce","TroyOunce"]
["2021-06-18","2021-06-18T10:59:19","18 Jun 2021",304.92,304.92,304.92,"USD","Tonne",null,null,null,null,null,null,null,null,null,null,null,null,null,null,null,null,null,null,null,null,null,"UAH","UAH - Ukraine Hryvnia","JPY",{"$f":"INDEX($AE$21:$AE$38,MATCH(TRUE,EXACT(AF35,$AD$21:$AD$38),0))","v":{"$error":"#N/A"}},"JPY","WetTonne","WetTonne"]
["2021-06-11","2021-06-11T10:36:03","11 Jun 2021",297.69,297.69,297.69,"USD","Tonne",null,null,null,null,null,null,null,null,null,null,null,null,null,null,null,null,null,null,null,null,null,"USd","Usd - US cent","KRW",{"$f":"INDEX($AE$21:$AE$38,MATCH(TRUE,EXACT(AF36,$AD$21:$AD$38),0))","v":{"$error":"#N/A"}},"KRW"]
["2021-06-04","2021-06-04T10:53:05","04 Jun 2021",290.99,290.99,290.99,"USD","Tonne",null,null,null,null,null,null,null,null,null,null,null,null,null,null,null,null,null,null,null,null,null,"USD","USD -  US Dollar","MXN",{"$f":"INDEX($AE$21:$AE$38,MATCH(TRUE,EXACT(AF37,$AD$21:$AD$38),0))","v":{"$error":"#N/A"}},"MXN"]
["2021-05-28","2021-05-28T10:44:03","28 May 2021",279.82,279.82,279.82,"USD","Tonne",null,null,null,null,null,null,null,null,null,null,null,null,null,null,null,null,null,null,null,null,null,"ZAR","ZAR - South African Rand","PEN",null,"PEN"]
["2021-05-21","2021-05-21T10:51:53","21 May 2021",300.10000000000002,300.10000000000002,300.10000000000002,"USD","Tonne",null,null,null,null,null,null,null,null,null,null,null,null,null,null,null,null,null,null,null,null,null,null,null,"PLN",null,"PLN"]
["2021-05-14","2021-05-14T10:48:27","14 May 2021",314.5,314.5,314.5,"USD","Tonne",null,null,null,null,null,null,null,null,null,null,null,null,null,null,null,null,null,null,null,null,null,null,null,"RUB",null,"RUB"]
["2021-05-07","2021-05-07T10:41:23","07 May 2021",284.12,284.12,284.12,"USD","Tonne",null,null,null,null,null,null,null,null,null,null,null,null,null,null,null,null,null,null,null,null,null,null,null,"SEK",null,"SEK"]
["2021-04-30","2021-04-30T10:32:14","30 Apr 2021",262.04000000000002,262.04000000000002,262.04000000000002,"USD","Tonne",null,null,null,null,null,null,null,null,null,null,null,null,null,null,null,null,null,null,null,null,null,null,null,"TRY",null,"TRY"]
["2021-04-23","2021-04-23T10:49:55","23 Apr 2021",252.38,252.38,252.38,"USD","Tonne",null,null,null,null,null,null,null,null,null,null,null,null,null,null,null,null,null,null,null,null,null,null,null,"UAH",null,"UAH"]
["2021-04-16","2021-04-16T10:47:35","16 Apr 2021",231.12,231.12,231.12,"USD","Tonne",null,null,null,null,null,null,null,null,null,null,null,null,null,null,null,null,null,null,null,null,null,null,null,"USd",null,"USd"]
["2021-04-09","2021-04-09T10:45:01","09 Apr 2021",228.98,228.98,228.98,"USD","Tonne",null,null,null,null,null,null,null,null,null,null,null,null,null,null,null,null,null,null,null,null,null,null,null,"ZAR",null,"ZAR"]
["2021-04-01","2021-04-01T10:48:56","01 Apr 2021",221.84,221.84,221.84,"USD","Tonne"]
["2021-03-26","2021-03-26T10:53:11","26 Mar 2021",220.84,220.84,220.84,"USD","Tonne"]
["2021-03-19","2021-03-19T10:51:39","19 Mar 2021",231.08,231.08,231.08,"USD","Tonne"]
["2021-03-12","2021-03-12T10:35:16","12 Mar 2021",227.43,227.43,227.43,"USD","Tonne"]
["2021-03-05","2021-03-05T10:46:29","05 Mar 2021",225.24,225.24,225.24,"USD","Tonne"]
["2021-02-26","2021-02-26T10:34:21","26 Feb 2021",222.08,222.08,222.08,"USD","Tonne"]
["2021-02-19","2021-02-19T10:31:18","19 Feb 2021",213.54,213.54,213.54,"USD","Tonne"]
["2021-02-11","2021-02-11T10:06:34","11 Feb 2021",214.57,214.57,214.57,"USD","Tonne"]
["2021-02-05","2021-02-05T10:34:27","05 Feb 2021",212.27,212.27,212.27,"USD","Tonne"]
["2021-01-29","2021-01-29T10:43:26","29 Jan 2021",225.49,225.49,225.49,"USD","Tonne"]
["2021-01-22","2021-01-22T10:40:34","22 Jan 2021",229.26,229.26,229.26,"USD","Tonne"]
["2021-01-15","2021-01-15T10:57:20","15 Jan 2021",229.28,229.28,229.28,"USD","Tonne"]
["2021-01-08","2021-01-08T10:59:53","08 Jan 2021",218.04,218.04,218.04,"USD","Tonne"]
["2020-12-31","2020-12-31T10:30:51","31 Dec 2020",215.11,215.11,215.11,"USD","Tonne"]
["2020-12-24","2020-12-24T10:47:30","24 Dec 2020",213.86,213.86,213.86,"USD","Tonne"]
["2020-12-18","2020-12-18T10:32:43","18 Dec 2020",199.28,199.28,199.28,"USD","Tonne"]
["2020-12-11","2020-12-11T10:48:24","11 Dec 2020",185.71,185.71,185.71,"USD","Tonne"]
["2020-12-04","2020-12-04T10:57:44","04 Dec 2020",167.39,167.39,167.39,"USD","Tonne"]
["2020-11-27","2020-11-27T10:45:11","27 Nov 2020",158.77000000000001,158.77000000000001,158.77000000000001,"USD","Tonne"]
["2020-11-20","2020-11-20T10:52:50","20 Nov 2020",157.96,157.96,157.96,"USD","Tonne"]
["2020-11-13","2020-11-13T10:38:33","13 Nov 2020",157.72,157.72,157.72,"USD","Tonne"]
["2020-11-06","2020-11-06T10:31:56","06 Nov 2020",150.71,150.71,150.71,"USD","Tonne"]
["2020-10-30","2020-10-30T10:46:54","30 Oct 2020",150.55000000000001,150.55000000000001,150.55000000000001,"USD","Tonne"]
["2020-10-23","2020-10-23T10:33:17","23 Oct 2020",148.97,148.97,148.97,"USD","Tonne"]
["2020-10-16","2020-10-16T10:38:04","16 Oct 2020",147.32,147.32,147.32,"USD","Tonne"]
["2020-10-09","2020-10-09T10:47:12","09 Oct 2020",143.66,143.66,143.66,"USD","Tonne"]
["2020-10-02","2020-10-02T10:30:00","02 Oct 2020",143.52000000000001,143.52000000000001,143.52000000000001,"USD","Tonne"]
["2020-09-25","2020-09-25T10:51:03","25 Sep 2020",138.84,138.84,138.84,"USD","Tonne"]
["2020-09-18","2020-09-18T10:51:22","18 Sep 2020",147.25,147.25,147.25,"USD","Tonne"]
["2020-09-11","2020-09-11T10:51:01","11 Sep 2020",146.6,146.6,146.6,"USD","Tonne"]
["2020-09-04","2020-09-04T10:39:26","04 Sep 2020",143.07,143.07,143.07,"USD","Tonne"]
["2020-08-28","2020-08-28T10:48:23","28 Aug 2020",138.16999999999999,138.16999999999999,138.16999999999999,"USD","Tonne"]
["2020-08-21","2020-08-21T10:40:51","21 Aug 2020",139.27000000000001,139.27000000000001,139.27000000000001,"USD","Tonne"]
["2020-08-14","2020-08-14T10:51:51","14 Aug 2020",134.13999999999999,134.13999999999999,134.13999999999999,"USD","Tonne"]
["2020-08-07","2020-08-07T10:49:44","07 Aug 2020",131.04,131.04,131.04,"USD","Tonne"]
["2020-07-30","2020-07-30T10:47:48","30 Jul 2020",125.36,125.36,125.36,"USD","Tonne"]
["2020-07-24","2020-07-24T10:38:55","24 Jul 2020",125.67,125.67,125.67,"USD","Tonne"]
["2020-07-17","2020-07-17T11:17:06","17 Jul 2020",128.28,128.28,128.28,"USD","Tonne"]
["2020-07-09","2020-07-09T10:35:23","09 Jul 2020",120.17,120.17,120.17,"USD","Tonne"]
["2020-07-03","2020-07-03T11:10:12","03 Jul 2020",119.97,119.97,119.97,"USD","Tonne"]
["2020-06-26","2020-06-26T10:05:16","26 Jun 2020",120.33,120.33,120.33,"USD","Tonne"]
["2020-06-19","2020-06-19T10:53:37","19 Jun 2020",122.13,122.13,122.13,"USD","Tonne"]
["2020-06-12","2020-06-12T10:41:59","12 Jun 2020",123.48,123.48,123.48,"USD","Tonne"]
["2020-06-05","2020-06-05T10:58:10","05 Jun 2020",122.17,122.17,122.17,"USD","Tonne"]
["2020-05-29","2020-05-29T11:07:21","29 May 2020",118.78,118.78,118.78,"USD","Tonne"]
["2020-05-22","2020-05-22T10:48:54","22 May 2020",118.4,118.4,118.4,"USD","Tonne"]
["2020-05-15","2020-05-15T11:04:22","15 May 2020",113.1,113.1,113.1,"USD","Tonne"]
["2020-05-08","2020-05-08T11:39:35","08 May 2020",107.29,107.29,107.29,"USD","Tonne"]
["2020-04-30","2020-04-30T11:36:57","30 Apr 2020",108.03,108.03,108.03,"USD","Tonne"]
["2020-04-24","2020-04-24T11:00:41","24 Apr 2020",108.26,108.26,108.26,"USD","Tonne"]
["2020-04-17","2020-04-17T11:02:50","17 Apr 2020",110.49,110.49,110.49,"USD","Tonne"]
["2020-04-09","2020-04-09T10:52:29","09 Apr 2020",114.62,114.62,114.62,"USD","Tonne"]
["2020-04-03","2020-04-03T11:08:57","03 Apr 2020",114.83,114.83,114.83,"USD","Tonne"]
["2020-03-27","2020-03-27T11:14:47","27 Mar 2020",121.68,121.68,121.68,"USD","Tonne"]
["2020-03-20","2020-03-20T11:08:34","20 Mar 2020",123.31,123.31,123.31,"USD","Tonne"]
["2020-03-13","2020-03-13T13:47:44","13 Mar 2020",124.26,124.26,124.26,"USD","Tonne"]
["2020-03-06","2020-03-06T10:49:53","06 Mar 2020",124.81,124.81,124.81,"USD","Tonne"]
["2020-02-28","2020-02-28T10:46:14","28 Feb 2020",122.55,122.55,122.55,"USD","Tonne"]
["2020-02-21","2020-02-21T10:40:41","21 Feb 2020",125.25,125.25,125.25,"USD","Tonne"]
["2020-02-14","2020-02-14T10:50:29","14 Feb 2020",124.78,124.78,124.78,"USD","Tonne"]
["2020-02-07","2020-02-07T11:01:45","07 Feb 2020",128.09,128.09,128.09,"USD","Tonne"]
["2020-01-31","2020-01-31T11:20:18","31 Jan 2020",130.53,130.53,130.53,"USD","Tonne"]
["2020-01-24","2020-01-24T10:59:16","24 Jan 2020",130.53,130.53,130.53,"USD","Tonne"]
["2020-01-17","2020-01-17T11:05:54","17 Jan 2020",127.21,127.21,127.21,"USD","Tonne"]
["2020-01-10","2020-01-10T11:20:17","10 Jan 2020",125.03,125.03,125.03,"USD","Tonne"]
["2020-01-03","2020-01-03T11:09:13","03 Jan 2020",122.17,122.17,122.17,"USD","Tonne"]
["2019-12-27","2019-12-27T11:41:05","27 Dec 2019",120.43,120.43,120.43,"USD","Tonne"]
["2019-12-20","2019-12-20T10:55:36","20 Dec 2019",120.23,120.23,120.23,"USD","Tonne"]
["2019-12-13","2019-12-13T10:49:13","13 Dec 2019",120.1,120.1,120.1,"USD","Tonne"]
["2019-12-06","2019-12-06T13:04:00","06 Dec 2019",116.19,116.19,116.19,"USD","Tonne"]
["2019-11-29","2019-11-29T10:55:21","29 Nov 2019",115.35,115.35,115.35,"USD","Tonne"]
["2019-11-22","2019-11-22T10:46:25","22 Nov 2019",113.06,113.06,113.06,"USD","Tonne"]
["2019-11-15","2019-11-15T11:12:11","15 Nov 2019",109.48,109.48,109.48,"USD","Tonne"]
["2019-11-08","2019-11-08T11:31:11","08 Nov 2019",108.9,108.9,108.9,"USD","Tonne"]
["2019-11-01","2019-11-01T11:16:55","01 Nov 2019",109.8,109.8,109.8,"USD","Tonne"]
["2019-10-25","2019-10-25T11:03:43","25 Oct 2019",110.64,110.64,110.64,"USD","Tonne"]
["2019-10-18","2019-10-18T11:06:27","18 Oct 2019",112.92,112.92,112.92,"USD","Tonne"]
["2019-10-11","2019-10-11T11:04:45","11 Oct 2019",112.69,112.69,112.69,"USD","Tonne"]
["2019-10-04","2019-10-04T10:25:33","04 Oct 2019",112.28,112.28,112.28,"USD","Tonne"]
["2019-09-27","2019-09-27T12:41:23","27 Sep 2019",112.28,112.28,112.28,"USD","Tonne"]
["2019-09-20","2019-09-20T11:22:49","20 Sep 2019",114.4,114.4,114.4,"USD","Tonne"]
["2019-09-13","2019-09-13T10:39:59","13 Sep 2019",117.32,117.32,117.32,"USD","Tonne"]
["2019-09-06","2019-09-06T11:23:32","06 Sep 2019",115.36,115.36,115.36,"USD","Tonne"]
["2019-08-30","2019-08-30T11:05:18","30 Aug 2019",113.57,113.57,113.57,"USD","Tonne"]
["2019-08-23","2019-08-23T11:07:20","23 Aug 2019",117.06,117.06,117.06,"USD","Tonne"]
["2019-08-16","2019-08-16T11:10:19","16 Aug 2019",123.86,123.86,123.86,"USD","Tonne"]
["2019-08-08","2019-08-08T10:48:05","08 Aug 2019",134.88999999999999,134.88999999999999,134.88999999999999,"USD","Tonne"]
["2019-08-02","2019-08-02T11:10:30","02 Aug 2019",141.56,141.56,141.56,"USD","Tonne"]
["2019-07-26","2019-07-26T11:17:17","26 Jul 2019",141.93,141.93,141.93,"USD","Tonne"]
["2019-07-19","2019-07-19T11:05:20","19 Jul 2019",143.97,143.97,143.97,"USD","Tonne"]
["2019-07-12","2019-07-12T11:06:22","12 Jul 2019",146.63999999999999,146.63999999999999,146.63999999999999,"USD","Tonne"]
["2019-07-05","2019-07-05T10:45:34","05 Jul 2019",147.08000000000001,147.08000000000001,147.08000000000001,"USD","Tonne"]
["2019-06-28","2019-06-28T11:20:49","28 Jun 2019",146.02000000000001,146.02000000000001,146.02000000000001,"USD","Tonne"]
["2019-06-21","2019-06-21T11:13:39","21 Jun 2019",143.71,143.71,143.71,"USD","Tonne"]
["2019-06-14","2019-06-14T11:17:12","14 Jun 2019",139.53,139.53,139.53,"USD","Tonne"]
["2019-06-07","2019-06-07T10:34:14","07 Jun 2019",133.85,133.85,133.85,"USD","Tonne"]
["2019-05-31","2019-05-31T11:17:00","31 May 2019",137.82,137.82,137.82,"USD","Tonne"]
["2019-05-24","2019-05-24T11:03:28","24 May 2019",136.09,136.09,136.09,"USD","Tonne"]
["2019-05-17","2019-05-17T11:43:15","17 May 2019",129.93,129.93,129.93,"USD","Tonne"]
["2019-05-10","2019-05-10T11:27:02","10 May 2019",128.58000000000001,128.58000000000001,128.58000000000001,"USD","Tonne"]
["2019-05-03","2019-05-03T11:17:57","03 May 2019",128.18,128.18,128.18,"USD","Tonne"]
["2019-04-26","2019-04-26T11:10:26","26 Apr 2019",126.91,126.91,126.91,"USD","Tonne"]
["2019-04-18","2019-04-18T11:10:03","18 Apr 2019",128.08000000000001,128.08000000000001,128.08000000000001,"USD","Tonne"]
["2019-04-12","2019-04-12T11:22:18","12 Apr 2019",127.5,127.5,127.5,"USD","Tonne"]
["2019-04-05","2019-04-05T11:35:32","05 Apr 2019",126.13,126.13,126.13,"USD","Tonne"]
["2019-03-29","2019-03-29T11:12:29","29 Mar 2019",126.27,126.27,126.27,"USD","Tonne"]
["2019-03-22","2019-03-22T11:11:27","22 Mar 2019",124.31,124.31,124.31,"USD","Tonne"]
["2019-03-15","2019-03-15T11:35:48","15 Mar 2019",127.08,127.08,127.08,"USD","Tonne"]
["2019-03-08","2019-03-08T11:22:41","08 Mar 2019",127.52,127.52,127.52,"USD","Tonne"]
["2019-03-01","2019-03-01T11:14:55","01 Mar 2019",130.63999999999999,130.63999999999999,130.63999999999999,"USD","Tonne"]
["2019-02-22","2019-02-22T10:57:50","22 Feb 2019",131.29,131.29,131.29,"USD","Tonne"]
["2019-02-15","2019-02-15T11:00:00","15 Feb 2019",141.75,141.75,141.75,"USD","Tonne"]
["2019-02-08","2019-02-08T10:51:18","08 Feb 2019",133.94,133.94,133.94,"USD","Tonne"]
["2019-02-01","2019-02-01T10:58:12","01 Feb 2019",128.68,128.68,128.68,"USD","Tonne"]
["2019-01-25","2019-01-25T11:09:41","25 Jan 2019",122.13,122.13,122.13,"USD","Tonne"]
["2019-01-18","2019-01-18T11:17:15","18 Jan 2019",121.55,121.55,121.55,"USD","Tonne"]
["2019-01-11","2019-01-11T10:50:08","11 Jan 2019",120.21,120.21,120.21,"USD","Tonne"]
["2019-01-04","2019-01-04T10:50:28","04 Jan 2019",121.38,121.38,121.38,"USD","Tonne"]
["2018-12-28","2018-12-28T10:59:46","28 Dec 2018",122.42,122.42,122.42,"USD","Tonne"]
["2018-12-21","2018-12-21T11:00:08","21 Dec 2018",121.49,121.49,121.49,"USD","Tonne"]
["2018-12-14","2018-12-14T10:47:38","14 Dec 2018",118.58,118.58,118.58,"USD","Tonne"]
["2018-12-07","2018-12-07T10:45:38","07 Dec 2018",120.1,120.1,120.1,"USD","Tonne"]
["2018-11-30","2018-11-30T11:04:20","30 Nov 2018",119.44,119.44,119.44,"USD","Tonne"]
["2018-11-23","2018-11-23T10:42:48","23 Nov 2018",132.07,132.07,132.07,"USD","Tonne"]
["2018-11-16","2018-11-16T10:47:29","16 Nov 2018",134.06,134.06,134.06,"USD","Tonne"]
["2018-11-09","2018-11-09T11:02:26","09 Nov 2018",142.55000000000001,142.55000000000001,142.55000000000001,"USD","Tonne"]
["2018-11-02","2018-11-02T11:04:06","02 Nov 2018",145.76,145.76,145.76,"USD","Tonne"]
["2018-10-26","2018-10-26T11:03:39","26 Oct 2018",152.47,152.47,152.47,"USD","Tonne"]
["2018-10-19","2018-10-19T10:54:13","19 Oct 2018",155.63,155.63,155.63,"USD","Tonne"]
["2018-10-12","2018-10-12T11:24:43","12 Oct 2018",160.54,160.54,160.54,"USD","Tonne"]
["2018-10-05","2018-10-05T10:58:41","05 Oct 2018",161.63999999999999,161.63999999999999,161.63999999999999,"USD","Tonne"]
["2018-09-28","2018-09-28T10:48:57","28 Sep 2018",161.63999999999999,161.63999999999999,161.63999999999999,"USD","Tonne"]
["2018-09-21","2018-09-21T10:48:42","21 Sep 2018",161.37,161.37,161.37,"USD","Tonne"]
["2018-09-14","2018-09-14T11:16:29","14 Sep 2018",161.52000000000001,161.52000000000001,161.52000000000001,"USD","Tonne"]
["2018-09-07","2018-09-07T10:59:39","07 Sep 2018",159.61000000000001,159.61000000000001,159.61000000000001,"USD","Tonne"]
["2018-08-31","2018-08-31T11:02:14","31 Aug 2018",158.44999999999999,158.44999999999999,158.44999999999999,"USD","Tonne"]
["2018-08-24","2018-08-24T11:04:01","24 Aug 2018",158.93,158.93,158.93,"USD","Tonne"]
["2018-08-17","2018-08-17T11:14:12","17 Aug 2018",149.05000000000001,149.05000000000001,149.05000000000001,"USD","Tonne"]
["2018-08-10","2018-08-10T10:48:37","10 Aug 2018",143.16999999999999,143.16999999999999,143.16999999999999,"USD","Tonne"]
["2018-08-03","2018-08-03T10:51:32","03 Aug 2018",133.94999999999999,133.94999999999999,133.94999999999999,"USD","Tonne"]
["2018-07-27","2018-07-27T11:00:23","27 Jul 2018",133.05000000000001,133.05000000000001,133.05000000000001,"USD","Tonne"]
["2018-07-20","2018-07-20T11:13:47","20 Jul 2018",132.9,132.9,132.9,"USD","Tonne"]
["2018-07-13","2018-07-13T11:10:36","13 Jul 2018",131.66,131.66,131.66,"USD","Tonne"]
["2018-07-06","2018-07-06T11:02:26","06 Jul 2018",120.68,120.68,120.68,"USD","Tonne"]
["2018-06-29","2018-06-29T10:43:21","29 Jun 2018",117.32,117.32,117.32,"USD","Tonne"]
["2018-06-22","2018-06-22T11:18:51","22 Jun 2018",114.48,114.48,114.48,"USD","Tonne"]
["2018-06-14","2018-06-14T10:58:29","14 Jun 2018",112.04,112.04,112.04,"USD","Tonne"]
["2018-06-08","2018-06-08T10:54:37","08 Jun 2018",110.97,110.97,110.97,"USD","Tonne"]
["2018-06-01","2018-06-01T10:51:47","01 Jun 2018",111.15,111.15,111.15,"USD","Tonne"]
["2018-05-25","2018-05-25T10:47:05","25 May 2018",111.2,111.2,111.2,"USD","Tonne"]
["2018-05-18","2018-05-18T10:37:50","18 May 2018",111.92,111.92,111.92,"USD","Tonne"]
["2018-05-11","2018-05-11T10:40:25","11 May 2018",111.28,111.28,111.28,"USD","Tonne"]
["2018-05-04","2018-05-04T10:34:00","04 May 2018",112.67,112.67,112.67,"USD","Tonne"]
["2018-04-27","2018-04-27T10:41:59","27 Apr 2018",112.29,112.29,112.29,"USD","Tonne"]
["2018-04-20","2018-04-20T10:48:43","20 Apr 2018",111.33,111.33,111.33,"USD","Tonne"]
["2018-04-13","2018-04-13T10:54:48","13 Apr 2018",110.06,110.06,110.06,"USD","Tonne"]
["2018-04-06","2018-04-06T10:51:11","06 Apr 2018",110.31,110.31,110.31,"USD","Tonne"]
["2018-03-29","2018-03-29T10:54:49","29 Mar 2018",110.31,110.31,110.31,"USD","Tonne"]
["2018-03-23","2018-03-23T10:39:00","23 Mar 2018",116.52,116.52,116.52,"USD","Tonne"]
["2018-03-16","2018-03-16T10:43:09","16 Mar 2018",117.56,117.56,117.56,"USD","Tonne"]
["2018-03-09","2018-03-09T10:40:44","09 Mar 2018",117.91,117.91,117.91,"USD","Tonne"]
["2018-03-02","2018-03-02T10:42:02","02 Mar 2018",119.34,119.34,119.34,"USD","Tonne"]
["2018-02-23","2018-02-23T10:39:47","23 Feb 2018",119.24,119.24,119.24,"USD","Tonne"]
["2018-02-15","2018-02-15T10:24:35","15 Feb 2018",119.24,119.24,119.24,"USD","Tonne"]
["2018-02-09","2018-02-09T11:16:02","09 Feb 2018",119.24,119.24,119.24,"USD","Tonne"]
["2018-02-02","2018-02-02T10:39:56","02 Feb 2018",119.33,119.33,119.33,"USD","Tonne"]
["2018-01-26","2018-01-26T10:46:19","26 Jan 2018",120.1,120.1,120.1,"USD","Tonne"]
["2018-01-19","2018-01-19T10:45:46","19 Jan 2018",120.26,120.26,120.26,"USD","Tonne"]
["2018-01-12","2018-01-12T10:34:09","12 Jan 2018",120.34,120.34,120.34,"USD","Tonne"]
["2018-01-05","2018-01-05T11:07:37","05 Jan 2018",120.66,120.66,120.66,"USD","Tonne"]
["2017-12-29","2017-12-29T11:03:51","29 Dec 2017",119.08,119.08,119.08,"USD","Tonne"]
["2017-12-22","2017-12-22T10:38:05","22 Dec 2017",118.39,118.39,118.39,"USD","Tonne"]
["2017-12-15","2017-12-15T11:02:11","15 Dec 2017",117.4,117.4,117.4,"USD","Tonne"]
["2017-12-08","2017-12-08T10:42:32","08 Dec 2017",117.63,117.63,117.63,"USD","Tonne"]
["2017-12-01","2017-12-01T10:59:01","01 Dec 2017",121.02,121.02,121.02,"USD","Tonne"]
["2017-11-24","2017-11-24T10:45:27","24 Nov 2017",122.7,122.7,122.7,"USD","Tonne"]
["2017-11-17","2017-11-17T10:38:54","17 Nov 2017",123.88,123.88,123.88,"USD","Tonne"]
["2017-11-10","2017-11-10T10:58:13","10 Nov 2017",125.14,125.14,125.14,"USD","Tonne"]
["2017-11-03","2017-11-03T10:42:08","03 Nov 2017",122.6,122.6,122.6,"USD","Tonne"]
["2017-10-27","2017-10-27T10:48:03","27 Oct 2017",123.92,123.92,123.92,"USD","Tonne"]
["2017-10-20","2017-10-20T11:03:03","20 Oct 2017",119.91,119.91,119.91,"USD","Tonne"]
["2017-10-13","2017-10-13T11:03:32","13 Oct 2017",117.1,117.1,117.1,"USD","Tonne"]
["2017-10-06","2017-10-06T10:30:50","06 Oct 2017",121.32,121.32,121.32,"USD","Tonne"]
["2017-09-29","2017-09-29T10:37:03","29 Sep 2017",121.32,121.32,121.32,"USD","Tonne"]
["2017-09-22","2017-09-22T10:49:28","22 Sep 2017",121.87,121.87,121.87,"USD","Tonne"]
["2017-09-15","2017-09-15T10:55:50","15 Sep 2017",127.44,127.44,127.44,"USD","Tonne"]
["2017-09-08","2017-09-08T10:53:55","08 Sep 2017",125.58,125.58,125.58,"USD","Tonne"]
["2017-08-31","2017-08-31T07:52:55","31 Aug 2017",117.03,117.03,117.03,"USD","Tonne"]
["2017-08-25","2017-08-25T10:52:20","25 Aug 2017",114.01,114.01,114.01,"USD","Tonne"]
["2017-08-18","2017-08-18T10:36:01","18 Aug 2017",111.4,111.4,111.4,"USD","Tonne"]
["2017-08-11","2017-08-11T10:43:05","11 Aug 2017",111.61,111.61,111.61,"USD","Tonne"]
["2017-08-04","2017-08-04T11:30:51","04 Aug 2017",107.97,107.97,107.97,"USD","Tonne"]
["2017-07-28","2017-07-28T10:38:41","28 Jul 2017",103.35,103.35,103.35,"USD","Tonne"]
["2017-07-21","2017-07-21T12:25:07","21 Jul 2017",102.17,102.17,102.17,"USD","Tonne"]
["2017-07-14","2017-07-14T10:43:55","14 Jul 2017",100.75,100.75,100.75,"USD","Tonne"]
["2017-07-07","2017-07-07T10:40:51","07 Jul 2017",98.62,98.62,98.62,"USD","Tonne"]
["2017-06-30","2017-06-30T10:39:04","30 Jun 2017",96.05,96.05,96.05,"USD","Tonne"]
["2017-06-23","2017-06-23T10:56:17","23 Jun 2017",88.36,88.36,88.36,"USD","Tonne"]
["2017-06-16","2017-06-16T10:35:02","16 Jun 2017",87.93,87.93,87.93,"USD","Tonne"]
["2017-06-09","2017-06-09T10:36:00","09 Jun 2017",86.02,86.02,86.02,"USD","Tonne"]
["2017-06-02","2017-06-02T10:30:51","02 Jun 2017",89.04,89.04,89.04,"USD","Tonne"]
["2017-05-26","2017-05-26T10:32:53","26 May 2017",86.02,86.02,86.02,"USD","Tonne"]
["2017-05-19","2017-05-19T10:23:11","19 May 2017",85.85,85.85,85.85,"USD","Tonne"]
["2017-05-12","2017-05-12T10:30:00","12 May 2017",82.07,82.07,82.07,"USD","Tonne"]
["2017-05-05","2017-05-05T10:34:42","05 May 2017",86.57,86.57,86.57,"USD","Tonne"]
["2017-04-28","2017-04-28T10:29:22","28 Apr 2017",86.38,86.38,86.38,"USD","Tonne"]
["2017-04-21","2017-04-21T10:30:19","21 Apr 2017",84.5,84.5,84.5,"USD","Tonne"]
["2017-04-13","2017-04-13T10:30:32","13 Apr 2017",90.5,90.5,90.5,"USD","Tonne"]
["2017-04-07","2017-04-07T10:30:23","07 Apr 2017",98.32,98.32,98.32,"USD","Tonne"]
["2017-03-31","2017-03-31T10:32:23","31 Mar 2017",101.39,101.39,101.39,"USD","Tonne"]
["2017-03-24","2017-03-24T10:26:19","24 Mar 2017",106.05,106.05,106.05,"USD","Tonne"]
["2017-03-17","2017-03-17T10:33:18","17 Mar 2017",109.64,109.64,109.64,"USD","Tonne"]
["2017-03-10","2017-03-10T10:30:27","10 Mar 2017",109.05,109.05,109.05,"USD","Tonne"]
["2017-03-03","2017-03-03T10:30:59","03 Mar 2017",115.22,115.22,115.22,"USD","Tonne"]
["2017-02-24","2017-02-24T10:30:15","24 Feb 2017",117.6,117.6,117.6,"USD","Tonne"]
["2017-02-17","2017-02-17T10:28:32","17 Feb 2017",114.45,114.45,114.45,"USD","Tonne"]
["2017-02-10","2017-02-10T10:29:05","10 Feb 2017",107.41,107.41,107.41,"USD","Tonne"]
["2017-02-03","2017-02-03T10:30:22","03 Feb 2017",108.58,108.58,108.58,"USD","Tonne"]
["2017-01-27","2017-01-27T10:33:27","27 Jan 2017",108.58,108.58,108.58,"USD","Tonne"]
["2017-01-20","2017-01-20T11:33:30","20 Jan 2017",107.93,107.93,107.93,"USD","Tonne"]
["2017-01-13","2017-01-13T10:30:50","13 Jan 2017",105.38,105.38,105.38,"USD","Tonne"]
["2017-01-06","2017-01-06T10:30:11","06 Jan 2017",105.47,105.47,105.47,"USD","Tonne"]
["2016-12-30","2016-12-30T10:30:33","30 Dec 2016",106.97,106.97,106.97,"USD","Tonne"]
["2016-12-23","2016-12-23T10:31:54","23 Dec 2016",105.66,105.66,105.66,"USD","Tonne"]
["2016-12-16","2016-12-16T10:30:01","16 Dec 2016",109.73,109.73,109.73,"USD","Tonne"]
["2016-12-09","2016-12-09T10:29:18","09 Dec 2016",110.7,110.7,110.7,"USD","Tonne"]
["2016-12-02","2016-12-02T10:32:24","02 Dec 2016",109.49,109.49,109.49,"USD","Tonne"]
["2016-11-25","2016-11-25T10:32:34","25 Nov 2016",109.67,109.67,109.67,"USD","Tonne"]
["2016-11-18","2016-11-18T10:30:18","18 Nov 2016",106.5,106.5,106.5,"USD","Tonne"]
["2016-11-11","2016-11-11T10:34:14","11 Nov 2016",106.98,106.98,106.98,"USD","Tonne"]
["2016-11-04","2016-11-04T10:28:28","04 Nov 2016",96.54,96.54,96.54,"USD","Tonne"]
["2016-10-28","2016-10-28T10:30:40","28 Oct 2016",96.85,96.85,96.85,"USD","Tonne"]
["2016-10-21","2016-10-21T10:28:50","21 Oct 2016",92.85,92.85,92.85,"USD","Tonne"]
["2016-10-14","2016-10-14T10:29:42","14 Oct 2016",90.39,90.39,90.39,"USD","Tonne"]
["2016-10-07","2016-10-07T10:35:06","07 Oct 2016",89.83,89.83,89.83,"USD","Tonne"]
["2016-09-30","2016-09-30T10:38:45","30 Sep 2016",89.83,89.83,89.83,"USD","Tonne"]
["2016-09-23","2016-09-23T11:21:04","23 Sep 2016",92.46,92.46,92.46,"USD","Tonne"]
["2016-09-16","2016-09-16T10:26:23","16 Sep 2016",91.96,91.96,91.96,"USD","Tonne"]
["2016-09-09","2016-09-09T10:35:18","09 Sep 2016",94.29,94.29,94.29,"USD","Tonne"]
["2016-09-02","2016-09-02T10:33:50","02 Sep 2016",92.78,92.78,92.78,"USD","Tonne"]
["2016-08-26","2016-08-26T11:00:42","26 Aug 2016",93.18,93.18,93.18,"USD","Tonne"]
["2016-08-19","2016-08-19T10:44:34","19 Aug 2016",92.81,92.81,92.81,"USD","Tonne"]
["2016-08-12","2016-08-12T10:36:18","12 Aug 2016",93.1,93.1,93.1,"USD","Tonne"]
["2016-08-05","2016-08-05T10:36:30","05 Aug 2016",91.14,91.14,91.14,"USD","Tonne"]
["2016-07-29","2016-07-29T10:42:45","29 Jul 2016",87.86,87.86,87.86,"USD","Tonne"]
["2016-07-22","2016-07-22T10:32:49","22 Jul 2016",83.36,83.36,83.36,"USD","Tonne"]
["2016-07-15","2016-07-15T10:31:56","15 Jul 2016",85.69,85.69,85.69,"USD","Tonne"]
["2016-07-08","2016-07-08T10:33:20","08 Jul 2016",80.86,80.86,80.86,"USD","Tonne"]
["2016-07-01","2016-07-01T11:27:27","01 Jul 2016",78.400000000000006,78.400000000000006,78.400000000000006,"USD","Tonne"]
["2016-06-24","2016-06-24T10:41:15","24 Jun 2016",76.31,76.31,76.31,"USD","Tonne"]
["2016-06-17","2016-06-17T10:30:05","17 Jun 2016",74.83,74.83,74.83,"USD","Tonne"]
["2016-06-10","2016-06-10T10:39:05","10 Jun 2016",71.73,71.73,71.73,"USD","Tonne"]
["2016-06-03","2016-06-03T10:44:14","03 Jun 2016",69.88,69.88,69.88,"USD","Tonne"]
["2016-05-27","2016-05-27T10:43:25","27 May 2016",71.599999999999994,71.599999999999994,71.599999999999994,"USD","Tonne"]
["2016-05-20","2016-05-20T10:51:55","20 May 2016",77.459999999999994,77.459999999999994,77.459999999999994,"USD","Tonne"]
["2016-05-13","2016-05-13T10:46:44","13 May 2016",80.44,80.44,80.44,"USD","Tonne"]
["2016-05-06","2016-05-06T10:39:46","06 May 2016",84.57,84.57,84.57,"USD","Tonne"]
["2016-04-29","2016-04-29T10:30:58","29 Apr 2016",87.39,87.39,87.39,"USD","Tonne"]
["2016-04-22","2016-04-22T10:43:12","22 Apr 2016",86.81,86.81,86.81,"USD","Tonne"]
["2016-04-15","2016-04-15T10:53:56","15 Apr 2016",81.099999999999994,81.099999999999994,81.099999999999994,"USD","Tonne"]
["2016-04-08","2016-04-08T10:45:51","08 Apr 2016",75.790000000000006,75.790000000000006,75.790000000000006,"USD","Tonne"]
["2016-04-01","2016-04-01T10:37:55","01 Apr 2016",73.83,73.83,73.83,"USD","Tonne"]
["2016-03-24","2016-03-24T10:54:07","24 Mar 2016",75.42,75.42,75.42,"USD","Tonne"]
["2016-03-18","2016-03-18T10:37:31","18 Mar 2016",72.36,72.36,72.36,"USD","Tonne"]
["2016-03-11","2016-03-11T10:35:20","11 Mar 2016",77.8,77.8,77.8,"USD","Tonne"]
["2016-03-04","2016-03-04T16:03:43","04 Mar 2016",65.67,65.67,65.67,"USD","Tonne"]
["2016-02-26","2016-02-26T10:39:00","26 Feb 2016",63.98,63.98,63.98,"USD","Tonne"]
["2016-02-19","2016-02-19T10:30:54","19 Feb 2016",62.58,62.58,62.58,"USD","Tonne"]
["2016-02-12","2016-02-12T10:39:21","12 Feb 2016",59.85,59.85,59.85,"USD","Tonne"]
["2016-02-05","2016-02-05T10:31:58","05 Feb 2016",59.85,59.85,59.85,"USD","Tonne"]
["2016-01-29","2016-01-29T11:02:54","29 Jan 2016",57.69,57.69,57.69,"USD","Tonne"]
["2016-01-22","2016-01-22T11:01:22","22 Jan 2016",55.01,55.01,55.01,"USD","Tonne"]
["2016-01-15","2016-01-15T11:00:21","15 Jan 2016",53.92,53.92,53.92,"USD","Tonne"]
["2016-01-08","2016-01-08T11:01:40","08 Jan 2016",56,56,56,"USD","Tonne"]
["2015-12-31","2015-12-31T11:00:13","31 Dec 2015",54.92,54.92,54.92,"USD","Tonne"]
["2015-12-24","2015-12-24T11:00:45","24 Dec 2015",52.6,52.6,52.6,"USD","Tonne"]
["2015-12-18","2015-12-18T11:00:40","18 Dec 2015",52.02,52.02,52.02,"USD","Tonne"]
["2015-12-11","2015-12-11T11:00:47","11 Dec 2015",54.26,54.26,54.26,"USD","Tonne"]
["2015-12-04","2015-12-04T11:00:14","04 Dec 2015",56.74,56.74,56.74,"USD","Tonne"]
["2015-11-27","2015-11-27T11:43:29","27 Nov 2015",58.25,58.25,58.25,"USD","Tonne"]
["2015-11-20","2015-11-20T11:03:10","20 Nov 2015",62.42,62.42,62.42,"USD","Tonne"]
["2015-11-13","2015-11-13T11:00:26","13 Nov 2015",64.94,64.94,64.94,"USD","Tonne"]
["2015-11-06","2015-11-06T11:05:28","06 Nov 2015",67.92,67.92,67.92,"USD","Tonne"]
["2015-10-30","2015-10-30T11:00:05","30 Oct 2015",69.33,69.33,69.33,"USD","Tonne"]
["2015-10-23","2015-10-23T11:00:29","23 Oct 2015",71.58,71.58,71.58,"USD","Tonne"]
["2015-10-16","2015-10-16T11:00:46","16 Oct 2015",70.510000000000005,70.510000000000005,70.510000000000005,"USD","Tonne"]
["2015-10-09","2015-10-09T11:07:45","09 Oct 2015",70.95,70.95,70.95,"USD","Tonne"]
["2015-10-02","2015-10-02T11:00:46","02 Oct 2015",72.900000000000006,72.900000000000006,72.900000000000006,"USD","Tonne"]
["2015-09-25","2015-09-25T11:00:09","25 Sep 2015",74.849999999999994,74.849999999999994,74.849999999999994,"USD","Tonne"]
["2015-09-18","2015-09-18T11:00:20","18 Sep 2015",75.8,75.8,75.8,"USD","Tonne"]
["2015-09-10","2015-09-10T11:00:29","10 Sep 2015",76.260000000000005,76.260000000000005,76.260000000000005,"USD","Tonne"]
["2015-09-04","2015-09-04T11:00:40","04 Sep 2015",75.91,75.91,75.91,"USD","Tonne"]
["2015-08-28","2015-08-28T11:00:17","28 Aug 2015",77.319999999999993,77.319999999999993,77.319999999999993,"USD","Tonne"]
["2015-08-21","2015-08-21T11:00:39","21 Aug 2015",78.23,78.23,78.23,"USD","Tonne"]
["2015-08-14","2015-08-14T12:22:18","14 Aug 2015",76.260000000000005,76.260000000000005,76.260000000000005,"USD","Tonne"]
["2015-08-06","2015-08-06T11:00:52","06 Aug 2015",74.5,74.5,74.5,"USD","Tonne"]
["2015-07-31","2015-07-31T11:00:06","31 Jul 2015",72.73,72.73,72.73,"USD","Tonne"]
["2015-07-24","2015-07-24T11:21:23","24 Jul 2015",68.569999999999993,68.569999999999993,68.569999999999993,"USD","Tonne"]
["2015-07-16","2015-07-16T11:00:12","16 Jul 2015",67.77,67.77,67.77,"USD","Tonne"]
["2015-07-10","2015-07-10T11:00:10","10 Jul 2015",65.39,65.39,65.39,"USD","Tonne"]
["2015-07-03","2015-07-03T11:00:47","03 Jul 2015",71.31,71.31,71.31,"USD","Tonne"]
["2015-06-26","2015-06-26T11:03:49","26 Jun 2015",79.75,79.75,79.75,"USD","Tonne"]
["2015-06-19","2015-06-19T11:01:46","19 Jun 2015",82.07,82.07,82.07,"USD","Tonne"]
["2015-06-12","2015-06-12T11:00:23","12 Jun 2015",87.81,87.81,87.81,"USD","Tonne"]
["2015-06-05","2015-06-05T11:51:30","05 Jun 2015",90.44,90.44,90.44,"USD","Tonne"]
["2015-05-29","2015-05-29T11:00:54","29 May 2015",87.25,87.25,87.25,"USD","Tonne"]
["2015-05-22","2015-05-22T11:00:36","22 May 2015",84.2,84.2,84.2,"USD","Tonne"]
["2015-05-15","2015-05-15T11:00:38","15 May 2015",86.4,86.4,86.4,"USD","Tonne"]
["2015-05-08","2015-05-08T11:00:27","08 May 2015",86.63,86.63,86.63,"USD","Tonne"]
["2015-04-30","2015-04-30T11:00:00","30 Apr 2015",86.28,86.28,86.28,"USD","Tonne"]
["2015-04-24","2015-04-24T11:00:33","24 Apr 2015",84.41,84.41,84.41,"USD","Tonne"]
["2015-04-17","2015-04-17T11:00:58","17 Apr 2015",82.01,82.01,82.01,"USD","Tonne"]
["2015-04-10","2015-04-10T11:00:32","10 Apr 2015",78.319999999999993,78.319999999999993,78.319999999999993,"USD","Tonne"]
["2015-04-02","2015-04-02T11:00:02","02 Apr 2015",78.599999999999994,78.599999999999994,78.599999999999994,"USD","Tonne"]
["2015-03-27","2015-03-27T11:07:47","27 Mar 2015",82.5,82.5,82.5,"USD","Tonne"]
["2015-03-20","2015-03-20T11:29:26","20 Mar 2015",84.03,84.03,84.03,"USD","Tonne"]
["2015-03-13","2015-03-13","13 Mar 2015",89.83,89.83,89.83,"USD","Tonne"]
["2015-03-06","2015-03-06","06 Mar 2015",94.75,94.75,94.75,"USD","Tonne"]
["2015-02-27","2015-02-27","27 Feb 2015",94.83,94.83,94.83,"USD","Tonne"]
["2015-02-18","2015-02-18","18 Feb 2015",95.68,95.68,95.68,"USD","Tonne"]
["2015-02-13","2015-02-13","13 Feb 2015",94.23,94.23,94.23,"USD","Tonne"]
["2015-02-06","2015-02-06","06 Feb 2015",101.47,101.47,101.47,"USD","Tonne"]
["2015-01-30","2015-01-30T11:17:23","30 Jan 2015",101.18,101.18,101.18,"USD","Tonne"]
["2015-01-23","2015-01-23T11:30:00","23 Jan 2015",103.6,103.6,103.6,"USD","Tonne"]
["2015-01-16","2015-01-16T11:25:42","16 Jan 2015",104.38,104.38,104.38,"USD","Tonne"]
["2015-01-09","2015-01-09T12:23:23","09 Jan 2015",106.93,106.93,106.93,"USD","Tonne"]
["2015-01-02","2015-01-02T11:36:31","02 Jan 2015",105.04,105.04,105.04,"USD","Tonne"]
["2014-12-26","2014-12-26T11:00:00","26 Dec 2014",103.33,103.33,103.33,"USD","Tonne"]
["2014-12-19","2014-12-19T11:49:51","19 Dec 2014",104,104,104,"USD","Tonne"]
["2014-12-12","2014-12-12T11:21:44","12 Dec 2014",104.33,104.33,104.33,"USD","Tonne"]
["2014-12-05","2014-12-05T11:45:50","05 Dec 2014",105.17,105.17,105.17,"USD","Tonne"]
["2014-11-28","2014-11-28T11:44:25","28 Nov 2014",105.25,105.25,105.25,"USD","Tonne"]
["2014-11-21","2014-11-21T11:24:17","21 Nov 2014",107,107,107,"USD","Tonne"]
["2014-11-14","2014-11-14","14 Nov 2014",111.61,111.61,111.61,"USD","Tonne"]
["2014-11-07","2014-11-07","07 Nov 2014",110.76,110.76,110.76,"USD","Tonne"]
["2014-10-31","2014-10-31","31 Oct 2014",112.83,112.83,112.83,"USD","Tonne"]
["2014-10-24","2014-10-24","24 Oct 2014",114.24,114.24,114.24,"USD","Tonne"]
["2014-10-17","2014-10-17","17 Oct 2014",112.25,112.25,112.25,"USD","Tonne"]
["2014-10-10","2014-10-10","10 Oct 2014",110.56,110.56,110.56,"USD","Tonne"]
["2014-10-03","2014-10-03","03 Oct 2014",109.22,109.22,109.22,"USD","Tonne"]
["2014-09-26","2014-09-26","26 Sep 2014",110.39,110.39,110.39,"USD","Tonne"]
["2014-09-19","2014-09-19","19 Sep 2014",114.68,114.68,114.68,"USD","Tonne"]
["2014-09-12","2014-09-12","12 Sep 2014",114.17,114.17,114.17,"USD","Tonne"]
["2014-09-05","2014-09-05","05 Sep 2014",116.58,116.58,116.58,"USD","Tonne"]
["2014-08-29","2014-08-29","29 Aug 2014",118.2,118.2,118.2,"USD","Tonne"]
["2014-08-22","2014-08-22","22 Aug 2014",120.9,120.9,120.9,"USD","Tonne"]
["2014-08-15","2014-08-15","15 Aug 2014",120.98,120.98,120.98,"USD","Tonne"]
["2014-08-08","2014-08-08","08 Aug 2014",121.49,121.49,121.49,"USD","Tonne"]
["2014-08-01","2014-08-01","01 Aug 2014",121.22,121.22,121.22,"USD","Tonne"]
["2014-07-25","2014-07-25","25 Jul 2014",122.37,122.37,122.37,"USD","Tonne"]
["2014-07-18","2014-07-18","18 Jul 2014",123.96,123.96,123.96,"USD","Tonne"]
["2014-07-11","2014-07-11","11 Jul 2014",120.99,120.99,120.99,"USD","Tonne"]
["2014-07-04","2014-07-04","04 Jul 2014",118.08,118.08,118.08,"USD","Tonne"]
["2014-06-27","2014-06-27","27 Jun 2014",119.17,119.17,119.17,"USD","Tonne"]
["2014-06-20","2014-06-20","20 Jun 2014",116.83,116.83,116.83,"USD","Tonne"]
["2014-06-13","2014-06-13","13 Jun 2014",117.76,117.76,117.76,"USD","Tonne"]
["2014-06-06","2014-06-06","06 Jun 2014",123.89,123.89,123.89,"USD","Tonne"]
["2014-05-30","2014-05-30","30 May 2014",122.36,122.36,122.36,"USD","Tonne"]
["2014-05-23","2014-05-23","23 May 2014",125.58,125.58,125.58,"USD","Tonne"]
["2014-05-16","2014-05-16","16 May 2014",128.78,128.78,128.78,"USD","Tonne"]
["2014-05-09","2014-05-09","09 May 2014",131.31,131.31,131.31,"USD","Tonne"]
["2014-05-02","2014-05-02","02 May 2014",136.61000000000001,136.61000000000001,136.61000000000001,"USD","Tonne"]
["2014-04-25","2014-04-25","25 Apr 2014",143.30000000000001,143.30000000000001,143.30000000000001,"USD","Tonne"]
["2014-04-17","2014-04-17","17 Apr 2014",144.09,144.09,144.09,"USD","Tonne"]
["2014-04-11","2014-04-11","11 Apr 2014",144.63,144.63,144.63,"USD","Tonne"]
["2014-04-04","2014-04-04","04 Apr 2014",144.19,144.19,144.19,"USD","Tonne"]
["2014-03-28","2014-03-28","28 Mar 2014",142.33000000000001,142.33000000000001,142.33000000000001,"USD","Tonne"]
["2014-03-21","2014-03-21","21 Mar 2014",142.30000000000001,142.30000000000001,142.30000000000001,"USD","Tonne"]
["2014-03-14","2014-03-14","14 Mar 2014",144.16999999999999,144.16999999999999,144.16999999999999,"USD","Tonne"]
["2014-03-07","2014-03-07","07 Mar 2014",151.6,151.6,151.6,"USD","Tonne"]
["2014-02-28","2014-02-28","28 Feb 2014",159.69,159.69,159.69,"USD","Tonne"]
["2014-02-21","2014-02-21","21 Feb 2014",163.19999999999999,163.19999999999999,163.19999999999999,"USD","Tonne"]
["2014-02-14","2014-02-14","14 Feb 2014",162,162,162,"USD","Tonne"]
["2014-02-07","2014-02-07","07 Feb 2014",167.1,167.1,167.1,"USD","Tonne"]
["2014-01-30","2014-01-30","30 Jan 2014",167.14,167.14,167.14,"USD","Tonne"]
["2014-01-24","2014-01-24","24 Jan 2014",173.82,173.82,173.82,"USD","Tonne"]
["2014-01-17","2014-01-17","17 Jan 2014",170.73,170.73,170.73,"USD","Tonne"]
["2014-01-10","2014-01-10","10 Jan 2014",175.06,175.06,175.06,"USD","Tonne"]
["2014-01-03","2014-01-03","03 Jan 2014",177.87,177.87,177.87,"USD","Tonne"]
["2013-12-27","2013-12-27","27 Dec 2013",176.65,176.65,176.65,"USD","Tonne"]
["2013-12-20","2013-12-20","20 Dec 2013",177.09,177.09,177.09,"USD","Tonne"]
["2013-12-13","2013-12-13","13 Dec 2013",178.73,178.73,178.73,"USD","Tonne"]
["2013-12-06","2013-12-06","06 Dec 2013",177.04,177.04,177.04,"USD","Tonne"]
["2013-11-29","2013-11-29","29 Nov 2013",173.29,173.29,173.29,"USD","Tonne"]
["2013-11-22","2013-11-22","22 Nov 2013",171.51,171.51,171.51,"USD","Tonne"]
["2013-11-15","2013-11-15","15 Nov 2013",169.91,169.91,169.91,"USD","Tonne"]
["2013-11-08","2013-11-08","08 Nov 2013",169.74,169.74,169.74,"USD","Tonne"]
["2013-11-01","2013-11-01","01 Nov 2013",167.08,167.08,167.08,"USD","Tonne"]
["2013-10-25","2013-10-25","25 Oct 2013",167.08,167.08,167.08,"USD","Tonne"]
["2013-10-18","2013-10-18","18 Oct 2013",165.45,165.45,165.45,"USD","Tonne"]
["2013-10-11","2013-10-11","11 Oct 2013",163.51,163.51,163.51,"USD","Tonne"]
["2013-10-04","2013-10-04","04 Oct 2013",160.13999999999999,160.13999999999999,160.13999999999999,"USD","Tonne"]
["2013-09-27","2013-09-27","27 Sep 2013",160.13999999999999,160.13999999999999,160.13999999999999,"USD","Tonne"]
["2013-09-20","2013-09-20","20 Sep 2013",158.65,158.65,158.65,"USD","Tonne"]
["2013-09-13","2013-09-13","13 Sep 2013",161.41999999999999,161.41999999999999,161.41999999999999,"USD","Tonne"]
["2013-09-06","2013-09-06","06 Sep 2013",159.29,159.29,159.29,"USD","Tonne"]
["2013-08-30","2013-08-30","30 Aug 2013",163.30000000000001,163.30000000000001,163.30000000000001,"USD","Tonne"]
["2013-08-23","2013-08-23","23 Aug 2013",163.93,163.93,163.93,"USD","Tonne"]
["2013-08-16","2013-08-16","16 Aug 2013",165.14,165.14,165.14,"USD","Tonne"]
["2013-08-09","2013-08-09","09 Aug 2013",163.49,163.49,163.49,"USD","Tonne"]
["2013-08-02","2013-08-02","02 Aug 2013",161.22,161.22,161.22,"USD","Tonne"]
["2013-07-26","2013-07-26","26 Jul 2013",161.24,161.24,161.24,"USD","Tonne"]
["2013-07-19","2013-07-19","19 Jul 2013",159.69999999999999,159.69999999999999,159.69999999999999,"USD","Tonne"]
["2013-07-12","2013-07-12","12 Jul 2013",153.66999999999999,153.66999999999999,153.66999999999999,"USD","Tonne"]
["2013-07-05","2013-07-05","05 Jul 2013",152.9,152.9,152.9,"USD","Tonne"]
["2013-06-28","2013-06-28","28 Jun 2013",148.83000000000001,148.83000000000001,148.83000000000001,"USD","Tonne"]
["2013-06-21","2013-06-21","21 Jun 2013",145.07,145.07,145.07,"USD","Tonne"]
["2013-06-14","2013-06-14","14 Jun 2013",138.32,138.32,138.32,"USD","Tonne"]
["2013-06-07","2013-06-07","07 Jun 2013",138.47,138.47,138.47,"USD","Tonne"]
["2013-05-31","2013-05-31","31 May 2013",140.66999999999999,140.66999999999999,140.66999999999999,"USD","Tonne"]
["2013-05-24","2013-05-24","24 May 2013",149,149,149,"USD","Tonne"]
["2013-05-17","2013-05-17","17 May 2013",154.15,154.15,154.15,"USD","Tonne"]
["2013-05-10","2013-05-10","10 May 2013",157.32,157.32,157.32,"USD","Tonne"]
["2013-05-03","2013-05-03","03 May 2013",158.80000000000001,158.80000000000001,158.80000000000001,"USD","Tonne"]
["2013-04-26","2013-04-26","26 Apr 2013",160.83000000000001,160.83000000000001,160.83000000000001,"USD","Tonne"]
["2013-04-19","2013-04-19","19 Apr 2013",162.66999999999999,162.66999999999999,162.66999999999999,"USD","Tonne"]
["2013-04-12","2013-04-12","12 Apr 2013",165.12,165.12,165.12,"USD","Tonne"]
["2013-04-05","2013-04-05","05 Apr 2013",161.66,161.66,161.66,"USD","Tonne"]
["2013-03-29","2013-03-29","29 Mar 2013",162,162,162,"USD","Tonne"]
["2013-03-22","2013-03-22","22 Mar 2013",156.91,156.91,156.91,"USD","Tonne"]
["2013-03-15","2013-03-15","15 Mar 2013",159.44,159.44,159.44,"USD","Tonne"]
["2013-03-08","2013-03-08","08 Mar 2013",170.8,170.8,170.8,"USD","Tonne"]
["2013-03-01","2013-03-01","01 Mar 2013",171.1,171.1,171.1,"USD","Tonne"]
["2013-02-22","2013-02-22","22 Feb 2013",174.07,174.07,174.07,"USD","Tonne"]
["2013-02-15","2013-02-15","15 Feb 2013",177.05,177.05,177.05,"USD","Tonne"]
["2013-02-08","2013-02-08","08 Feb 2013",177.05,177.05,177.05,"USD","Tonne"]
["2013-02-01","2013-02-01","01 Feb 2013",174.59,174.59,174.59,"USD","Tonne"]
["2013-01-25","2013-01-25","25 Jan 2013",172.63,172.63,172.63,"USD","Tonne"]
["2013-01-18","2013-01-18","18 Jan 2013",165.42,165.42,165.42,"USD","Tonne"]
["2013-01-11","2013-01-11","11 Jan 2013",177.89,177.89,177.89,"USD","Tonne"]
["2013-01-04","2013-01-04","04 Jan 2013",168.75,168.75,168.75,"USD","Tonne"]
["2012-12-28","2012-12-28","28 Dec 2012",162.19,162.19,162.19,"USD","Tonne"]
["2012-12-21","2012-12-21","21 Dec 2012",153.5,153.5,153.5,"USD","Tonne"]
["2012-12-14","2012-12-14","14 Dec 2012",148.57,148.57,148.57,"USD","Tonne"]
["2012-12-07","2012-12-07","07 Dec 2012",146.71,146.71,146.71,"USD","Tonne"]
["2012-11-30","2012-11-30","30 Nov 2012",142.12,142.12,142.12,"USD","Tonne"]
["2012-11-23","2012-11-23","23 Nov 2012",143.87,143.87,143.87,"USD","Tonne"]
["2012-11-16","2012-11-16","16 Nov 2012",147,147,147,"USD","Tonne"]
["2012-11-09","2012-11-09","09 Nov 2012",146.19,146.19,146.19,"USD","Tonne"]
["2012-11-02","2012-11-02","02 Nov 2012",144.76,144.76,144.76,"USD","Tonne"]
["2012-10-26","2012-10-26","26 Oct 2012",141.33000000000001,141.33000000000001,141.33000000000001,"USD","Tonne"]
["2012-10-19","2012-10-19","19 Oct 2012",133.09,133.09,133.09,"USD","Tonne"]
["2012-10-12","2012-10-12","12 Oct 2012",134.6,134.6,134.6,"USD","Tonne"]
["2012-10-05","2012-10-05","05 Oct 2012",126.45,126.45,126.45,"USD","Tonne"]
["2012-09-28","2012-09-28","28 Sep 2012",126.45,126.45,126.45,"USD","Tonne"]
["2012-09-21","2012-09-21","21 Sep 2012",126.67,126.67,126.67,"USD","Tonne"]
["2012-09-14","2012-09-14","14 Sep 2012",117.5,117.5,117.5,"USD","Tonne"]
["2012-09-07","2012-09-07","07 Sep 2012",110.43,110.43,110.43,"USD","Tonne"]
["2012-08-31","2012-08-31","31 Aug 2012",113.77,113.77,113.77,"USD","Tonne"]
["2012-08-24","2012-08-24","24 Aug 2012",123.64,123.64,123.64,"USD","Tonne"]
["2012-08-17","2012-08-17","17 Aug 2012",133.31,133.31,133.31,"USD","Tonne"]
["2012-08-10","2012-08-10","10 Aug 2012",136.69,136.69,136.69,"USD","Tonne"]
["2012-08-03","2012-08-03","03 Aug 2012",145.81,145.81,145.81,"USD","Tonne"]
["2012-07-27","2012-07-27","27 Jul 2012",148.80000000000001,148.80000000000001,148.80000000000001,"USD","Tonne"]
["2012-07-20","2012-07-20","20 Jul 2012",158.49,158.49,158.49,"USD","Tonne"]
["2012-07-13","2012-07-13","13 Jul 2012",164.87,164.87,164.87,"USD","Tonne"]
["2012-07-06","2012-07-06","06 Jul 2012",165.19,165.19,165.19,"USD","Tonne"]
["2012-06-29","2012-06-29","29 Jun 2012",166.1,166.1,166.1,"USD","Tonne"]
["2012-06-22","2012-06-22","22 Jun 2012",166.31,166.31,166.31,"USD","Tonne"]
["2012-06-15","2012-06-15","15 Jun 2012",165.26,165.26,165.26,"USD","Tonne"]
["2012-06-08","2012-06-08","08 Jun 2012",165.91,165.91,165.91,"USD","Tonne"]
["2012-06-01","2012-06-01","01 Jun 2012",165.19,165.19,165.19,"USD","Tonne"]
["2012-05-25","2012-05-25","25 May 2012",165.68,165.68,165.68,"USD","Tonne"]
["2012-05-18","2012-05-18","18 May 2012",170.3,170.3,170.3,"USD","Tonne"]
["2012-05-11","2012-05-11","11 May 2012",175.36,175.36,175.36,"USD","Tonne"]
["2012-05-04","2012-05-04","04 May 2012",176.58,176.58,176.58,"USD","Tonne"]
["2012-04-27","2012-04-27","27 Apr 2012",178.15,178.15,178.15,"USD","Tonne"]
["2012-04-20","2012-04-20","20 Apr 2012",179.28,179.28,179.28,"USD","Tonne"]
["2012-04-13","2012-04-13","13 Apr 2012",179.28,179.28,179.28,"USD","Tonne"]
["2012-04-06","2012-04-06","06 Apr 2012",179.28,179.28,179.28,"USD","Tonne"]

{"sheet":"Datagenics","index":7,"n_rows":688,"n_cols":3,"rows_kept":688,"cut":false,"hidden":true,"merged":[]}
["Price ID","Title","Package"]
[34122,"Latin America export billet $ per tonne fob main port","Steel Raw Materials"]
[34123,"Latin America export slab $ per tonne fob main port","Steel Raw Materials"]
[34127,"UK domestic stainless steel scrap 12-13% Cr Solids £ per tonne del merchants","Steel Raw Materials"]
[34128,"UK domestic stainless steel scrap 16-17% Cr solids £ per tonne del merchants","Steel Raw Materials"]
[34177,"Latin America export rebar $ per tonne fob main port","Steel Raw Materials"]
[34178,"Latin America export merchant bar (equal angles) $ per tonne fob main port","Steel Raw Materials"]
[34179,"Latin America export wire rod (mesh quality) $ per tonne fob main port","Steel Raw Materials"]
[34180,"Latin America export heavy plate (thicker than 10mm) $ per tonne fob main port","Steel Raw Materials"]
[34181,"Latin America export hot rolled coil (dry) $ per tonne fob main port","Steel Raw Materials"]
[34182,"Latin America export cold rolled coil $ per tonne fob main port","Steel Raw Materials"]
[34183,"Latin America export hot-dip galvanized coil $ per tonne fob main port","Steel Raw Materials"]
[34213,"USA import rebar $ per short ton cfr Port of Houston","Steel Raw Materials"]
[34214,"USA import merchant bar $ per short ton cfr Port of Houston","Steel Raw Materials"]
[34215,"USA import medium sections $ per short ton cfr Port of Houston","Steel Raw Materials"]
[34217,"USA import hot rolled coil (commodity grade) $ per short ton cfr Port of Houston","Steel Raw Materials"]
[34219,"USA import medium plate $ per short ton cfr Port of Houston","Steel Raw Materials"]
[34220,"USA import cold rolled coil $ per short ton cfr Port of Houston","Steel Raw Materials"]
[34322,"UK domestic ferrous scrap OA Plate and Structural £ per tonne del consumer","Steel Raw Materials"]
[34324,"UK domestic ferrous scrap 1&2 Old Steel £ per tonne del consumer","Steel Raw Materials"]
[34327,"UK domestic ferrous scrap 4A New Steel Bales £ per tonne del consumer","Steel Raw Materials"]
[34328,"UK domestic ferrous scrap 4C New Steel Bales £ per tonne del consumer","Steel Raw Materials"]
[34329,"UK domestic ferrous scrap 5C Loose Old Light £ per tonne del consumers","Steel Raw Materials"]
[34331,"UK domestic ferrous scrap 8A New Loose Light Cuttings £ per tonne del consumer","Steel Raw Materials"]
[34332,"UK domestic ferrous scrap 8B New Loose Light Cuttings £ per tonne del consumer","Steel Raw Materials"]
[34337,"UK domestic ferrous scrap 11A Cast Iron Borings (low phos) £ per tonne del consumer","Steel Raw Materials"]
[34344,"Ferrous scrap Rotterdam export shredded $ per tonne fob Rotterdam","Steel Raw Materials"]
[34359,"USA import wire rod (low carbon) $ per short ton cfr Port of Houston","Steel Raw Materials"]
[34363,"CIS export pig iron $ per tonne fob Black/Baltic Sea (Price split into separate Baltic and Black Sea assessments effective 26/04/12)","Steel Raw Materials"]
[34364,"CIS export billet $ per tonne fob Black Sea","Steel Raw Materials"]
[34365,"CIS export rebar $ per tonne fob Black Sea","Steel Raw Materials"]
[34366,"CIS export wire rod (mesh quality) $ per tonne fob Black Sea","Steel Raw Materials"]
[34367,"CIS export slab $ per tonne fob Black Sea","Steel Raw Materials"]
[34368,"CIS export heavy plate (10-50mm) $ per tonne fob Black Sea","Steel Raw Materials"]
[34369,"CIS export hot rolled coil $ per tonne fob Black Sea","Steel Raw Materials"]
[34370,"CIS export cold rolled coil $ per tonne fob Black Sea","Steel Raw Materials"]
[34380,"Turkey export billet $ per tonne fob main port","Steel Raw Materials"]
[34381,"Turkey export rebar $ per tonne fob main port","Steel Raw Materials"]
[34382,"Turkey export wire rod (mesh quality) $ per tonne fob main port","Steel Raw Materials"]
[34662,"Asia grade 304 stainless steel cold rolled coil (2mm 2B) $ per tonne cif East Asian port","Steel Raw Materials"]
[34663,"Asia grade 304 stainless steel hot rolled sheet $ per tonne cif East Asian port","Steel Raw Materials"]
[35276,"Europe import strip mill plate € per tonne cfr main EU port","Steel Raw Materials"]
[35285,"Northern Europe domestic grade 304 stainless steel cold rolled sheet (2mm) base price € per tonne del","Steel Raw Materials"]
[36098,"Latin America exports pig iron $ per tonne fob Vitorio/Rio Brazil","Steel Raw Materials"]
[36099,"Latin America exports pig iron $ per tonne fob Ponta da Madeira Brazil","Steel Raw Materials"]
[36101,"Europe domestic grade 304 stainless steel cold rolled sheet (2mm) alloy surcharge € per tonne","Steel Raw Materials"]
[36102,"Venezuelan export hot briquetted iron $ per tonne fob main port","Steel Raw Materials"]
[36103,"USA import pig iron $ per tonne cfr Gulf","Steel Raw Materials"]
[36112,"Southern China domestic rebar yuan per tonne ex-warehouse","Steel Raw Materials"]
[36113,"Southern China domestic wire rod (mesh quality) yuan per tonne ex-warehouse","Steel Raw Materials"]
[36114,"Southern China domestic cold rolled coil yuan per tonne ex-warehouse","Steel Raw Materials"]
[36115,"Southern China domestic hot rolled coil yuan per tonne ex-warehouse","Steel Raw Materials"]
[36116,"Eastern China domestic rebar yuan per tonne ex-warehouse","Steel Raw Materials"]
[36117,"Eastern China domestic wire rod (mesh quality) yuan per tonne ex-warehouse","Steel Raw Materials"]
[36118,"Eastern China domestic cold rolled coil yuan per tonne ex-warehouse","Steel Raw Materials"]
[36119,"Eastern China domestic hot rolled coil yuan per tonne ex-warehouse","Steel Raw Materials"]
[36162,"China export hot rolled coil $ per tonne fob main port","Steel Raw Materials"]
[36186,"UK domestic ferrous scrap 9A/10 Heavy and Light Cast Iron £ per tonne del consumer","Steel Raw Materials"]
[36187,"UK domestic ferrous scrap 9B/C Cylinder Block Scrap £ per tonne del consumer","Steel Raw Materials"]
[36228,"China export heavy plate $ per tonne fob main port","Steel Raw Materials"]
[36229,"China export galvanized coil (1mm) $ per tonne fob main port","Steel Raw Materials"]
[36230,"China export rebar $ per tonne fob main port","Steel Raw Materials"]
[36231,"China export wire rod (mesh quality) $ per tonne fob main port","Steel Raw Materials"]
[36232,"China domestic grade 304 stainless steel cold rolled coil (2mm) yuan per tonne in-warehouse","Steel Raw Materials"]
[36233,"China domestic grade 430 2mm stainless steel cold rolled coil yuan per tonne in-warehouse","Steel Raw Materials"]
[36234,"China domestic pig iron yuan per tonne del warehouse","Steel Raw Materials"]
[36235,"China domestic heavy scrap yuan per tonne del mill","Steel Raw Materials"]
[36236,"Iran domestic rebar (12-25mm) million rials per tonne ex-warehouse Tehran (price discontinued)","Steel Raw Materials"]
[36239,"Iran domestic hot rolled plate (15-40mm) million rials per tonne ex-warehouse Tehran (price discontinued)","Steel Raw Materials"]
[36240,"Iran domestic hot rolled coil (2-5mm) million rials per tonne ex-warehouse Tehran (price discontinued)","Steel Raw Materials"]
[36241,"Iran domestic cold rolled coil (0.5-1.25mm) million rials per tonne ex-warehouse Tehran (price discontinued)","Steel Raw Materials"]
[36242,"Iran domestic hot-dip galvanized coil (0.4-0.9mm) million rials per tonne ex-warehouse Tehran (price discontinued)","Steel Raw Materials"]
[36246,"India export billet $ per tonne fob main port","Steel Raw Materials"]
[36247,"India export heavy plate (12-40mm) $ per tonne fob main port","Steel Raw Materials"]
[36248,"India export hot rolled coil (commodity) $ per tonne fob main port","Steel Raw Materials"]
[36249,"India export hot-dip galvanized coil $ per tonne fob main port","Steel Raw Materials"]
[36250,"India import heavy plate (20-60mm) $ per tonne cfr main port","Steel Raw Materials"]
[36251,"Indian domestic billet rupees per tonne ex-works","Steel Raw Materials"]
[36253,"India domestic heavy plate rupees per tonne exw","Steel Raw Materials"]
[36254,"India domestic hot rolled coil rupees per tonne exw","Steel Raw Materials"]
[36255,"India domestic hot-dip galvanized coil rupees per tonne exw","Steel Raw Materials"]
[36256,"India import hot rolled coil $ per tonne cfr main port","Steel Raw Materials"]
[36263,"UAE import billet $ per tonne cfr Jebel Ali","Steel Raw Materials"]
[36264,"UAE import rebar $ per tonne cfr Jebel Ali","Steel Raw Materials"]
[36265,"UAE import hot rolled coil $ per tonne cfr Jebel Ali","Steel Raw Materials"]
[36266,"UAE import cold rolled coil $ per tonne cfr Jebel Ali","Steel Raw Materials"]
[36268,"Iran import billet $ per tonne cfr northern ports (price discontinued)","Steel Raw Materials"]
[36269,"India domestic cold rolled coil rupees per tonne ex-works","Steel Raw Materials"]
[36273,"Turkey domestic billet $ per tonne exw","Steel Raw Materials"]
[36274,"Turkey domestic rebar $ per tonne exw","Steel Raw Materials"]
[36275,"Turkey domestic wire rod (mesh quality) $ per tonne exw","Steel Raw Materials"]
[36276,"Turkey import billet $ per tonne cfr main port","Steel Raw Materials"]
[36277,"Turkey import hot rolled coil $ per tonne cfr main port","Steel Raw Materials"]
[36278,"USA domestic rebar $ per short ton fob mill","Steel Raw Materials"]
[36279,"USA domestic wire rod (mesh quality) $ per short ton fob mill","Steel Raw Materials"]
[36280,"USA domestic plate (up to 4 inches) $ per short ton fob mill","Steel Raw Materials"]
[36281,"USA domestic hot rolled sheet $ per short ton fob mill","Steel Raw Materials"]
[36282,"USA domestic cold rolled sheet $ per short ton fob mill","Steel Raw Materials"]
[36284,"Europe domestic plate (up to 10mm) € per tonne del","Steel Raw Materials"]
[36286,"Southern China domestic sections yuan per tonne ex-warehouse","Steel Raw Materials"]
[36287,"Southern China domestic plate yuan per tonne ex-warehouse","Steel Raw Materials"]
[36288,"Southern China domestic hot-dip galvanized coil yuan per tonne ex-warehouse","Steel Raw Materials"]
[36289,"Eastern China domestic sections yuan per tonne ex-warehouse","Steel Raw Materials"]
[36290,"Eastern China domestic plate yuan per tonne ex-warehouse","Steel Raw Materials"]
[36291,"Eastern China domestic hot-dip galvanized coil yuan per tonne ex-warehouse","Steel Raw Materials"]
[36292,"Turkey domestic hot rolled coil $ per tonne exw","Steel Raw Materials"]
[36293,"Turkey domestic cold rolled coil $ per tonne exw","Steel Raw Materials"]
[36306,"Turkey import cold rolled coil $ per tonne cfr main port","Steel Raw Materials"]
[36324,"Turkey export merchant bar $ per tonne fob main Turkish port","Steel Raw Materials"]
[36327,"Europe domestic grade 304 stainless steel bright bar base price € per tonne del","Steel Raw Materials"]
[36328,"Europe domestic grade 304 stainless steel bright bar alloy surcharge € per tonne","Steel Raw Materials"]
[36331,"Egypt domestic rebar E£ per tonne exw","Steel Raw Materials"]
[36332,"India domestic direct reduced iron rupees per tonne exw","Steel Raw Materials"]
[36338,"Turkey import ferrous scrap HMS 1&2 (75:25 mix) $ per tonne cfr main port","Steel Raw Materials"]
[36339,"Turkey import ferrous scrap shredded $ per tonne cfr main Turkish port","Steel Raw Materials"]
[36340,"Ferrous scrap Rotterdam export  HMS 1&2 (70:30 mix) $ per tonne fob Rotterdam","Steel Raw Materials"]
[36439,"UK domestic 18/8 solids wholesale £ per tonne del merchants","Steel Raw Materials"]
[36440,"UK domestic 18/8 turnings wholesale £ per tonne del merchants","Steel Raw Materials"]
[36994,"Iran import rebar $ per tonne cfr northern port (price discontinued)","Steel Raw Materials"]
[37644,"India import cold rolled coil $ per tonne cfr main port","Steel Raw Materials"]
[37728,"Daily Metal Bulletin Ferrous scrap Index HMS 1&2 (80:20 mix) (North Europe material) $ per tonne cfr Turkey","Steel Raw Materials"]
[37729,"China export cold rolled coil $ per tonne fob main port","Steel Raw Materials"]
[37734,"UK export ferrous scrap HMS 1&2 (80:20 mix) fob main port","Steel Raw Materials"]
[37735,"UK export ferrous scrap shredded $ per tonne fob main port","Steel Raw Materials"]
[42019,"India import ferrous scrap HMS 1&2 (80:20 mix) $ per tonne cfr Nhava Sheva","Steel Raw Materials"]
[42024,"Metal Bulletin Ferrous Scrap Index shredded $ per tonne cfr India","Steel Raw Materials"]
[42025,"Metal Bulletin Ferrous Scrap Index HMS 1&2 (80:20 mix) $ per tonne fob Rotterdam","Steel Raw Materials"]
[42048,"Index of spot market Iron Ore prices delivered to China, normalized to Qingdao and 62% Fe US $ per tonne Daily","Steel Raw Materials"]
[42152,"India import hot rolled coil (CR grade) $ per tonne cfr main port","Steel Raw Materials"]
[42153,"EU import rebar € per tonne cfr main EU port Southern Europe","Steel Raw Materials"]
[42154,"EU import wire rod (mesh quality) € per tonne cfr main EU port Southern Europe","Steel Raw Materials"]
[42155,"EU import Plate (8-40mm) € per tonne cfr main EU port Southern Europe","Steel Raw Materials"]
[42156,"EU import Hot rolled coil € per tonne cfr main EU port Southern Europe","Steel Raw Materials"]
[42157,"EU import cold rolled coil € per tonne cfr main EU port Southern Europe","Steel Raw Materials"]
[42158,"EU import hot-dip galvanized coil € per tonne cfr main EU port Southern Europe","Steel Raw Materials"]
[42159,"EU import rebar € per tonne cfr main EU port Northern Europe","Steel Raw Materials"]
[42160,"EU import wire rod (mesh quality) € per tonne cfr main EU port Northern Europe","Steel Raw Materials"]
[42161,"EU import Plate (8-40mm) € per tonne cfr main EU port Northern Europe","Steel Raw Materials"]
[42162,"EU import Hot rolled coil € per tonne cfr main EU port Northern Europe","Steel Raw Materials"]
[42163,"EU import cold rolled coil € per tonne cfr main EU port Northern Europe","Steel Raw Materials"]
[42164,"EU import hot-dip galvanized coil € per tonne cfr main EU port Northern Europe","Steel Raw Materials"]
[42165,"EU domestic rebar € per tonne del Southern Europe","Steel Raw Materials"]
[42166,"EU domestic wire rod (mesh quality) € per tonne del Southern Europe","Steel Raw Materials"]
[42167,"EU domestic hollow sections € per tonne del Southern Europe","Steel Raw Materials"]
[42168,"EU domestic plate (8-40mm) € per tonne ex-works Southern Europe","Steel Raw Materials"]
[42169,"EU domestic hot rolled coil € per tonne ex-works Southern Europe","Steel Raw Materials"]
[42170,"EU domestic cold rolled coil € per tonne ex-works Southern Europe","Steel Raw Materials"]
[42171,"EU domestic hot-dip galvanized coil € per tonne ex-works Southern Europe","Steel Raw Materials"]
[42172,"EU domestic rebar € per tonne del Northern Europe","Steel Raw Materials"]
[42173,"EU domestic wire rod (mesh quality) € per tonne del Northern Europe","Steel Raw Materials"]
[42174,"EU domestic hollow sections € per tonne del Northern Europe","Steel Raw Materials"]
[42175,"EU domestic plate (8-40mm) € per tonne ex-works Northern Europe","Steel Raw Materials"]
[42176,"EU domestic hot rolled coil € per tonne ex-works Northern Europe","Steel Raw Materials"]
[42177,"EU domestic cold rolled coil € per tonne ex-works Northern Europe","Steel Raw Materials"]
[42178,"EU domestic hot-dip galvanized coil € per tonne ex-works Northern Europe","Steel Raw Materials"]
[42179,"Southern Europe export rebar € per tonne fob main port","Steel Raw Materials"]
[42180,"Southern Europe export wire rod (mesh quality) € per tonne fob main port","Steel Raw Materials"]
[42181,"CIS export pig iron Baltic Sea $ per tonne fob main port","Steel Raw Materials"]
[42182,"CIS export pig iron Black Sea $ per tonne fob main port","Steel Raw Materials"]
[42183,"EU export grade 304 stainless steel cold rolled sheet (2mm) € per tonne fob North European port","Steel Raw Materials"]
[42184,"Europe import 18/8 solids € per tonne cif main European port","Steel Raw Materials"]
[42185,"Europe import 18/8 turnings € per tonne cif main European port","Steel Raw Materials"]
[42296,"Turkey domestic auto bundle scrap Turkish lira per tonne delivered","Steel Raw Materials"]
[42297,"Turkey domestic melting scrap from shipbreaking $ per tonne delivered","Steel Raw Materials"]
[42299,"EU domestic Northern Region hollow sections € per tonne ex-works (price discontinued)","Steel Raw Materials"]
[42300,"EU domestic Southern Region hollow sections € per tonne ex-works (price discontinued)","Steel Raw Materials"]
[42301,"Iron Ore Pellet Index cfr Qingdao (65% Fe) $ per dry metric tonne weekly index","Steel Raw Materials"]
[42302,"Iron Ore Concentrate Index (66% Fe) cfr Qingdao $ per dry metric tonne weekly index","Steel Raw Materials"]
[42303,"Turkey export hot rolled coil $ per tonne fob main port","Steel Raw Materials"]
[42305,"South America plate import $ per tonne cfr main ports","Steel Raw Materials"]
[42306,"South America import hot rolled coil $ per tonne cfr main ports","Steel Raw Materials"]
[42307,"South America import cold rolled coil $ per tonne cfr main ports","Steel Raw Materials"]
[42309,"India domestic rebar rupees per tonne ex works","Steel Raw Materials"]
[42310,"Metal Bulletin Indicator for US$/% Fe in Iron Ore Fines cfr Qingdao","Steel Raw Materials"]
[42384,"Iran import hot rolled coil $ per tonne cfr Iranian ports","Steel Raw Materials"]
[42385,"Iran import cold rolled coil $ per tonne cfr Iranian ports","Steel Raw Materials"]
[42387,"Iran import plate $ per tonne cfr Iranian ports (price discontinued)","Steel Raw Materials"]
[42389,"Iran domestic billet million rials per tonne ex stock Tehran (price discontinued)","Steel Raw Materials"]
[42393,"EU domestic 316 2mm cold rolled stainless sheet base price delivered € per tonne","Steel Raw Materials"]
[42394,"EU domestic 316 2mm cold rolled stainless sheet alloy surcharge delivered € per tonne","Steel Raw Materials"]
[42399,"China Hard Coking Coal Shanxi spot market domestic delivered Yuan per tonne ","Steel Raw Materials"]
[42400,"Northern China Tangshan Domestic Billet ex-works Yuan per tonne","Steel Raw Materials"]
[42401,"Northern China Domestic Rebar ex-warehouse Yuan per tonne","Steel Raw Materials"]
[42402,"Northern China Domestic Hot Rolled Coil ex-warehouse Yuan per tonne","Steel Raw Materials"]
[42403,"Poland domestic rebar ex-works zloty per tonne","Steel Raw Materials"]
[42405,"Brazil domestic rebar delivered Reais per tonne monthly","Steel Raw Materials"]
[42406,"Brazil domestic hot rolled coil ex-works Reais per tonne monthly ","Steel Raw Materials"]
[42407,"Brazil domestic cold rolled coil ex-works Reais per tonne monthly ","Steel Raw Materials"]
[42412,"South East Asia/East Asia import slab $ per tonne cfr","Steel Raw Materials"]
[42413,"South East Asia Import Billet $ per tonne cfr","Steel Raw Materials"]
[42414,"South East Asia Import Hot rolled coil $ per tonne cfr (Vietnam)","Steel Raw Materials"]
[42415,"South East Asia Import Cold rolled coil $ per tonne cfr (price discontinued)","Steel Raw Materials"]
[42417,"South East Asia Import Rebar $ per tonne cfr (Singapore)","Steel Raw Materials"]
[42418,"South East Asia Import Wire rod (low carbon) $ per tonne cfr","Steel Raw Materials"]
[42419,"Saudi Arabia import rebar $ per tonne cfr","Steel Raw Materials"]
[42420,"Saudi Arabia import hot rolled coil $ per tonne cfr","Steel Raw Materials"]
[42421,"Peru domestic rebar ex-works Peruvian Nuevos Soles per tonne monthly assessment (price discontinued)","Steel Raw Materials"]
[42423,"Argentina domestic hot rolled coil ex-works $ per tonne monthly assessment","Steel Raw Materials"]
[42424,"Argentina domestic cold rolled coil ex-works $ per tonne monthly assessment","Steel Raw Materials"]
[42426,"USA grade 304 stainless steel coiled plate $ per hundredweight fob mill monthly assessment","Steel Raw Materials"]
[42427,"USA grade 316 stainless steel coiled plate $ per hundredweight fob mill monthly assessment","Steel Raw Materials"]
[42428,"USA grade 304 stainless steel cold rolled sheet $ per hundredweight fob mill monthly assessment","Steel Raw Materials"]
[42429,"USA grade 316L stainless steel cold rolled sheet $ per hundredweight fob mill monthly assessment","Steel Raw Materials"]
[42430,"USA domestic ERW linepipe (X42) $ per short ton fob mill monthly assessment","Steel Raw Materials"]
[42431,"USA import ERW linepipe (X42) c&f $ per short ton monthly assessment","Steel Raw Materials"]
[42432,"USA import OCTG API5CT - casing J/K55 c&f $ per short ton delivered monthly assessment","Steel Raw Materials"]
[42433,"USA OCTG API5CT - casing J/K55 $ per short ton fob mill monthly assessment","Steel Raw Materials"]
[42434,"Russian domestic rebar rubles per tonne carriage paid (cpt) inc VAT","Steel Raw Materials"]
[42435,"Russian domestic hot rolled sheet rubles per tonne carriage paid (cpt) inc VAT","Steel Raw Materials"]
[42436,"Russian domestic Cold rolled sheet rubles per tonne carriage paid (cpt) inc VAT","Steel Raw Materials"]
[42437,"Scrap Indices No1 heavy melting scrap US domestic Midwest Index $ per gross ton monthly assessment","Steel Raw Materials"]
[42438,"Scrap Indices No1 busheling US domestic Midwest Index $ per gross ton monthly assessment","Steel Raw Materials"]
[42439,"Scrap Indices Shredded US domestic Midwest Index $ per gross ton monthly assessment","Steel Raw Materials"]
[42440,"USA import hot-dipped galvanized 0.012-0.015 G30 cfr Port of Houston $ per short ton","Steel Raw Materials"]
[42441,"USA import hot-dipped galvanized 0.019 G60 cfr Port of Houston $ per short ton (price discontinued)","Steel Raw Materials"]
[42442,"Turkey domestic hot dip galvanized $ per tonne ex-works","Steel Raw Materials"]
[42443,"USA domestic merchant bar 3 x 3 1/4 angle $ per hundredweight fob mill","Steel Raw Materials"]
[42444,"Metal Bulletin Coking Coal Index - Premium Hard Coking Coal $ per tonne CFR Jingtang","Steel Raw Materials"]
[42445,"Metal Bulletin Coking Coal Index - Hard Coking Coal $ per tonne CFR Jingtang","Steel Raw Materials"]
[42446,"Metal Bulletin Coking Coal Index - Premium Hard Coking Coal $ per tonne FOB DBCT","Steel Raw Materials"]
[42447,"Metal Bulletin Coking Coal Index - Hard Coking Coal $ per tonne FOB DBCT","Steel Raw Materials"]
[42457,"AMM Ferrous Scrap Export Index HMS 1&2 (80:20) $ per tonne East Coast fob New York","Steel Raw Materials"]
[42458,"AMM Ferrous Scrap Export Index Shredded $ per tonne East Coast fob New York","Steel Raw Materials"]
[42462,"EU domestic Stainless Steel 304 Europe Raw Materials Index $ per tonne","Steel Raw Materials"]
[42463,"Shanghai Futures Exchange rebar yuan per tonne settlement Month 1","Steel Raw Materials"]
[42464,"Shanghai Futures Exchange rebar yuan per tonne settlement Month 2","Steel Raw Materials"]
[42465,"Shanghai Futures Exchange rebar yuan per tonne settlement Month 3","Steel Raw Materials"]
[42466,"Shanghai Futures Exchange rebar weekly inventories, tonnes","Steel Raw Materials"]
[42467,"UAE domestic rebar UAE dirhams per tonne exw","Steel Raw Materials"]
[42480,"EU domestic beams € per tonne del Southern Europe","Steel Raw Materials"]
[42481,"EU domestic beams € per tonne del Northern Europe","Steel Raw Materials"]
[42482,"EU domestic beams € per tonne ex-works Northern Europe (price discontinued)","Steel Raw Materials"]
[42483,"EU domestic beams € per tonne ex-works Southern Europe (price discontinued)","Steel Raw Materials"]
[42484,"Turkey export S235JR grade EN10219 2mm wall thickness structural pipe $ per tonne fob main port","Steel Raw Materials"]
[42485,"Germany domestic No E3 (old thick steel scrap) € per tonne delivered to German mill","Steel Raw Materials"]
[42486,"Daily Metal Bulletin Ferrous scrap Index HMS 1&2 (80:20 mix) (USA material) $ per tonne cfr Turkey","Steel Raw Materials"]
[42529,"AMM USA domestic Hot-dipped galvanized (base) price $ per short ton Midwest market price fob mill","Steel Raw Materials"]
[42546,"Argentina domestic rebar ex-works $ per tonne monthly assessment","Steel Raw Materials"]
[42551,"Iron Ore Implied 58% Fe high specification price","Steel Raw Materials"]
[42552,"Iron Ore 62% Fe China port price index","Steel Raw Materials"]
[42559,"EU pig iron imports $ per tonne cif Italy","Steel Raw Materials"]
[42994,"Metal Bulletin 58% Fe Iron Ore Index (MBIOI-58) CFR Qingdao on a 58% fe basis Daily Price $ per dry metric tonne","Steel Raw Materials"]
[42995," High grade Premium (MBIOI-58P) CFR Qingdao on a 58% basis low alumina, low phosphorous Daily Price $ per dry metric tonne","Steel Raw Materials"]
[43048,"Metal Bulletins lump premium CFR Qingdao (MBIOI-LP Index) cents per dmtu daily","Steel Raw Materials"]
[43049,"Metal Bulletins 65% Fe Brazilian Index CFR Qingdao (MBIOI-65-BZ-Index) $ per tonne published daily from Sept 1 this is now a price","Steel Raw Materials"]
[43050,"Metal Bulletin Indicator for US$/% Si MBIOI Si-VIU cfr Qingdao Monthly indicator","Steel Raw Materials"]
[43064,"Metal Bulletin Indicator for US$/% Al MBIOI Al-VIU cfr Qingdao Monthly indicator","Steel Raw Materials"]
[43072,"Implied 62% Fe China Port Price $ per tonne","Steel Raw Materials"]
[43073,"Iron Ore Fines 65% Fe, % Fe value in use cfr Qingdao $ per dry metric tonne","Steel Raw Materials"]
[43075,"Germany domestic grade E40 (shredded steel scrap) € per tonne del mill","Steel Raw Materials"]
[43076,"Germany domestic grade E8 (thin new production steel scrap) € per tonne del mill","Steel Raw Materials"]
[43077,"UK inter-merchant ferrous scrap 7B Heavy Steel Turnings £ per tonne delivered to export dock","Steel Raw Materials"]
[43078,"UK domestic ferrous scrap 12 A/C new production heavy steel £ per tonne del consumer","Steel Raw Materials"]
[43079,"UK domestic ferrous scrap 12 D new production clean shovellable steel £ per tonne del consumer","Steel Raw Materials"]
[43080,"Taiwan import ferrous scrap HMS 1&2 (80:20 mix) (USA material) $ per tonne cfr main port","Steel Raw Materials"]
[43082,"Russian domestic plate rubles per tonne carriage paid (cpt) inc VAT","Steel Raw Materials"]
[43083,"Egypt import billet $ per tonne cfr main port","Steel Raw Materials"]
[43084,"65% CSR Coke $ per tonne FOB Tianjin","Steel Raw Materials"]
[43088,"Iron Ore Fines 62% Fe, 0.01% Phosphorous value in use MBIOI Phos-VIU cfr Qingdao US cent per dry metric tonne","Steel Raw Materials"]
[43096,"Algeria import rebar € per tonne cfr main port","Steel Raw Materials"]
[43097,"Metal Bulletin 60% Fe Iranian Fines Index (MBIOI-IR) CFR China US $ per tonne","Steel Raw Materials"]
[43262,"Iron Ore product differential - PBF delivered Qingdao, China CFR $ per tonne","Steel Raw Materials"]
[34018,"Indium, Indium Corp ingots min 99.97% $ per kg, fob","Minor Alloy"]
[34019,"Iridium ingot min 99.9% Europe Free market $ per troy oz in warehouse","Minor Alloy"]
[34021,"Molybdenum Canned molybdic oxide United States Free market $ per lb Mo in warehouse","Minor Alloy"]
[34022,"Molybdenum Drummed molybdic oxide Free market $ per lb Mo in warehouse","Minor Alloy"]
[34027,"Palladium min 99.9% Europe Free Market $ per troy oz in warehouse","Minor Alloy"]
[34029,"Platinum min. 99.9% European free market $ per troy oz in warehouse","Minor Alloy"]
[34031,"Rhodium min. 99.9% European free market $ troy oz in warehouse","Minor Alloy"]
[34033,"Ruthenium min. 99.9% European free market $ per troy oz in warehouse","Minor Alloy"]
[34065,"Ferro-chrome lumpy Cr charge, basis 52% Cr quarterly major European destinations $ per Ib Cr","Minor Alloy"]
[34066,"Ferro-chrome 6-8% C basis 60% Cr max. 1.5% Si major European destinations $ per lb Cr","Minor Alloy"]
[34067,"Ferro-chrome 0.10% C average 60-70% Cr major European destinations $ per lb Cr","Minor Alloy"]
[34068,"Ferro-manganese basis 78% Mn (Scale pro rata) - Standard 7.5% C major European destinations € per tonne","Minor Alloy"]
[34069,"Ferro-silicon lumpy basis 75% Si (Scale pro rata) major European destinations € per tonne","Minor Alloy"]
[34070,"Silico-manganese lumpy 65-75% Mn basis 15-19% Si (Scale pro rata) major European destinations Euro per tonne","Minor Alloy"]
[34071,"Ferro-molybdenum basis 65% min, in-warehouse Rotterdam, $ per kg Mo","Minor Alloy"]
[34072,"Ferro-tungsten basis 75% W Rotterdam duty unpaid $ per kg W in warehouse ","Minor Alloy"]
[34073,"Ferro-vanadium basis 78% min, free delivered duty paid, consumer plant,1st grade Western Europe, $ per kg V","Minor Alloy"]
[34088,"Vanadium pentoxide min 98%, in-warehouse Rotterdam $ per lb V2O5","Minor Alloy"]
[34089,"Zirconium Ore Foundry grade bulk Europe $ per tonne fob","Minor Alloy"]
[34090,"Zirconium Ore Premium bulk Europe $ per tonne fob","Minor Alloy"]
[34138,"Antimony MB free market in warehouse $ per tonne Monthly average ","Minor Alloy"]
[34139,"Bismuth MB free market tonne lots in warehouse $ per lb Monthly average ","Minor Alloy"]
[34143,"Molybdenum Drummed molybdic oxide Free market $ per lb Mo in warehouse Monthly average","Minor Alloy"]
[34144,"Molybdenum canned molybdic oxide United States Free market $ per lb Mo in warehouse Monthly average ","Minor Alloy"]
[34153,"Selenium MB free market $ per lb in warehouse Monthly average","Minor Alloy"]
[34161,"Vanadium pentoxide min 98%, in-warehouse Rotterdam monthly average $ per lb V2O5","Minor Alloy"]
[34188,"Silicon United States Free market Cents per lb","Minor Alloy"]
[34209,"Chromium World MB free market alumino-thermic min 99% $/tonne in warehouse","Minor Alloy"]
[34222,"Indium Ingots MB free market Monthly Average in warehouse $ per kg","Minor Alloy"]
[34236,"Ferro-chrome 6-8% C basis 60-65% Cr max 2% Si United States free market in warehouse Pittsburgh $ per lb Cr","Minor Alloy"]
[34238,"Ferro-manganese 78% Mn standard 7.5% C United States free market in warehouse Pittsburgh $ per long ton ","Minor Alloy"]
[34239,"Ferro-silicon Lumpy basis 75% Si, United States Free market, imported, in warehouse Pittsburgh. $ per lb","Minor Alloy"]
[34242,"Silico-manganese United States Free Market in warehouse Pittsburgh $ per lb","Minor Alloy"]
[34247,"Tungsten APT European free market $ per mtu","Minor Alloy"]
[34248,"Antimony MB free market $ per tonne in warehouse Rotterdam max 100 ppm Bi","Minor Alloy"]
[34249,"Bismuth MB free market tonne lots in warehouse $ per lb","Minor Alloy"]
[34250,"Cadmium min 99.95% MB free market Cts per lb cif global main port","Minor Alloy"]
[34251,"Cadmium min. 99.99% MB free market Cts per lb cif global main port","Minor Alloy"]
[34252,"Germanium Dioxide MB free market, $ per kilo","Minor Alloy"]
[34253,"Indium Ingots MB free market $ per kg in warehouse","Minor Alloy"]
[34254,"Manganese min. 99.7% electrolytic manganese flake MB free market $ per tonne in warehouse","Minor Alloy"]
[34256,"Mercury MB free market $ per flask in warehouse ","Minor Alloy"]
[34257,"Selenium MB free market $ per lb in warehouse","Minor Alloy"]
[34258,"Cobalt High Grade MB free market $ per lb in warehouse","Minor Alloy"]
[34259,"Cobalt Low Grade MB free market $ per lb in warehouse","Minor Alloy"]
[34260,"Cadmium 99.95% min MB free market Cts per lb cif global main port Monthly average","Minor Alloy"]
[34261,"Cadmium 99.99% min MB free market Cts per lb cif global main port Monthly average","Minor Alloy"]
[34262,"Cobalt High Grade MB free market $ per lb in warehouse Monthly average","Minor Alloy"]
[34263,"Germanium Dioxide MB free market $ per kg Monthly average ","Minor Alloy"]
[34264,"Tungsten APT European free market $ per mtu Monthly average","Minor Alloy"]
[34266,"Ferro-vanadium basis 78% min, free delivered duty paid, consumer plant,1st grade Western Europe, monthly average $ per kg V","Minor Alloy"]
[34268,"Cobalt Low Grade MB free market $ per lb in warehouse Monthly average","Minor Alloy"]
[34269,"Rhodium min. 99.9% European free market $ per troy oz Monthly average","Minor Alloy"]
[34271,"Arsenic MB free market $ per lb in warehouse","Minor Alloy"]
[34272,"Magnesium MB free market min $ per tonne","Minor Alloy"]
[34293,"Ferro-molybdenum 65/70% Mo US free market Pittsburgh $ per lb in warehouse","Minor Alloy"]
[34294,"Ferro-vanadium US free market 70-80% V in warehouse, Pittsburgh $ per lb.","Minor Alloy"]
[34351,"Ferro-silicon export from mainland China, Min 75% Si, 7.5% C, $/tonne, fob","Minor Alloy"]
[34357,"Silicon export from mainland China, 98.5% $/tonne, fob","Minor Alloy"]
[34358,"Tungsten APT export from mainland China, Chinese number 1 grade, min 88.5% WO 3, $/mtu, fob","Minor Alloy"]
[34445,"Ferro-titanium 70% (max 4.5% Al) MB free market $ per kg Ti d/d Europe","Minor Alloy"]
[34456,"Magnesium min 99.8% Mg, fob China main ports $ per tonne","Minor Alloy"]
[34464,"Silicon United States Free market Cents per lb Monthly Average","Minor Alloy"]
[34465,"Silicon export from mainland China, 98.5% $/tonne, fob monthly average","Minor Alloy"]
[34466,"Silicon MB free market Euros per tonne Monthly Average","Minor Alloy"]
[34473,"Manganese 99.7% electrolytic manganese flake MB free market Monthly Average $ per tonne in warehouse","Minor Alloy"]
[34572,"Lithium Ore Petalite 4.2% Li2O bagged fob Durban $ per tonne cif Europe (price discontinued)","Minor Alloy"]
[34573,"Lithium Ore Spodumene >7.5% Li2O cif Europe $ per tonne cif Europe (price discontinued)","Minor Alloy"]
[34576,"Titanium Ore Rutile conc. min 95% TiO2 Bagged US$ per tonne fob/Aus ","Minor Alloy"]
[34577,"Titanium Ore Rutile bulk conc. min 95% TiO2 $ per tonne fob/Aus","Minor Alloy"]
[34578,"Titanium Ore Ilmenite bulk conc. min 54% TiO2 $ per tonne fob/Aus ","Minor Alloy"]
[35116,"Ferro-chrome 0.06% C max - 65% Cr European low carbon in warehouse $ per lb Cr","Minor Alloy"]
[35117,"Ferro-chrome 0.05%C - 65% min Cr low carbon United States Free market duty paid fob Pittsburgh $ per lb Cr","Minor Alloy"]
[35118,"Ferro-chrome 0.10%C - 62% min Cr United States Free market low carbon duty paid fob Pittsburgh $ per lb Cr","Minor Alloy"]
[35119,"Ferro-chrome 0.15%C - 60% min Cr United States Free market low carbon duty paid fob Pittsburgh $ per lb Cr  ","Minor Alloy"]
[35123,"Ferro-manganese 80% min Mn 1.5 max C United States free market medium carbon duty paid fob Pittsburgh $ per lb","Minor Alloy"]
[35203,"Silicon MB free market Euros per tonne","Minor Alloy"]
[35268,"Ferro-molybdenum basis 65% min, in-warehouse Rotterdam, monthly average, $ per kg Mo","Minor Alloy"]
[35270,"Mercury MB free market $ per flask in warehouse Monthly Average   ","Minor Alloy"]
[35386,"Non-Ferrous Metals Magnesium Metal Chinese Free Market Averages 99.8% fob China main ports $ per tonne","Minor Alloy"]
[36155,"Antimony Metal MMTA Standard Grade II $/tonne in warehouse Rotterdam ","Minor Alloy"]
[36156,"Antimony metal MMTA Standard Grade II, $/tonne in warehouse Rotterdam, monthly average","Minor Alloy"]
[36157,"Ferro-Chrome China Spot 6-8% C, basis 50% Cr delivered duty paid China RMB/tonne ","Minor Alloy"]
[36177,"Ferro-Titanium 70% (max 4.5% Al) MB free market monthly average $/kg Ti d/d Europe","Minor Alloy"]
[36178,"Ferro-Tungsten basis 75% W min Monthly Average $/kg in warehouse Rotterdam","Minor Alloy"]
[36179,"Ferro-manganese MB Chinese free market min 65% Mn, max 7.0% C in warehouse China RMB/tonne","Minor Alloy"]
[36180,"Ferro-silicon MB Chinese free market min 75% in warehouse China RMB/tonne","Minor Alloy"]
[36181,"Tungsten concentrate MB Chinese free market, 65% W03, in warehouse China RMB/tonne","Minor Alloy"]
[36182,"Molybdenum concentrate MB Chinese free market, 45% Mo in warehouse China RMB/mtu","Minor Alloy"]
[36189,"Antimony Metal MB Chinese free market MMTA Standard Grade II delivered duty paid RMB/tonne","Minor Alloy"]
[36190,"Non-Ferrous Metals Magnesium Metal MB Chinese free market min 99% Mg, ex-works RMB/tonne","Minor Alloy"]
[36191,"Silico-manganese MB Chinese free market, min 65%   Mn max 17% Si, in warehouse China RMB/tonne","Minor Alloy"]
[36223,"Non-Ferrous Metals Rhenium in warehouse Rotterdam duty unpaid Metal Pellets min 99.9% $/Ib","Minor Alloy"]
[36224,"Non-Ferrous Metals Rhenium in warehouse Rotterdam duty unpaid APR Catalytic grade $/kg","Minor Alloy"]
[36227,"Ferro-Chrome China Contract 6-8% C, basis 50% Cr delivered duty paid China RMB/tonne","Minor Alloy"]
[36309,"Ferro-Chome Low phosphorous Cr min 65%, C max 7%, Si max 1%, P max 0.015%, Ti max 0.05% $ per lb","Minor Alloy"]
[36312,"Chrome Ore South Africa SA UG2 Met grade basis 42% $ per tonne cif main Chinese ports","Minor Alloy"]
[36336,"Non-Ferrous Metals Chrome Ore cfr main Chinese ports Turkish lumpy 40-42% $ per tonne","Minor Alloy"]
[42021,"Tellurium Metal MB free market min. 99.9% $/kg","Minor Alloy"]
[42022,"Gallium Metal MB free market $/kg   ","Minor Alloy"]
[42081,"Bismuth MB China domestic min 99.99% RMB/tonne","Minor Alloy"]
[42082,"Gallium MB China domestic, min 99.99% RMB/kg","Minor Alloy"]
[42083,"Indium MB China domestic min 99.99% RMB/kg","Minor Alloy"]
[42084,"Selenium MB China domestic min 99.9% RMB/kg","Minor Alloy"]
[42085,"Selenium dioxide MB China domestic min 98% RMB/kg","Minor Alloy"]
[42086,"Tellurium MB China domestic min 99.99% RMB/kg","Minor Alloy"]
[42087,"Germanium Metal Rotterdam $/kg","Minor Alloy"]
[42088,"Cobalt Metal MB China domestic min 99.8% RMB/tonne","Minor Alloy"]
[42089,"Germanium metal MB China domestic min 99.999% RMB/kg","Minor Alloy"]
[42151,"Germanium Metal Rotterdam $ per kg Monthly Average","Minor Alloy"]
[42260,"Ferro-chrome China import charge chrome 50% Cr index, CIF Shanghai, duty unpaid, $ per Ib contained chrome","Minor Alloy"]
[42280,"Gallium Metal MB free market $ per kg Monthly average  ","Minor Alloy"]
[42285,"Manganese Ore Index 44% Mn, Cif Tianjin $ per dmtu of metal contained","Minor Alloy"]
[42286,"Manganese Ore Index 37% Mn, Fob Port Elizabeth $ per dmtu of metal contained","Minor Alloy"]
[42460,"Cobalt High grade MB free market weighted average of all confirmed international trades $ per lb in warehouse","Minor Alloy"]
[42461,"Cobalt Low grade MB free market weighted average of all confirmed international trades $ per Ib in warehouse","Minor Alloy"]
[42557,"Silico-manganese 65% min Mn 16% min Si $ per tonne fob India","Minor Alloy"]
[43071,"Cobalt tetroxide min 72.6% Co delivered China RMB/tonne","Minor Alloy"]
[43117,"Ferro-Tungsten, China export min 75% $ per kg W, fob China","Minor Alloy"]
[43137,"Hafnium 1% Zr max, in warehouse global locations, $ per kg","Minor Alloy"]
[43149,"Ferro-chrome Japan import 8-9% C, basis 60% Cr, CIF Japan, duty unpaid, $ per lb contained chrome","Minor Alloy"]
[43156,"Ferro-chrome South Korea import 8-9% C, basis 60% Cr, CIF South Korea, duty unpaid, $ per lb contained chrome","Minor Alloy"]
[43157,"Ferro-nickel China premium, 26-32% nickel contained, cif China, $ per tonne","Minor Alloy"]
[34011,"Aluminium P1020A, in-warehouse Rotterdam duty-paid, spot $/tonne","Base Metals"]
[34012,"Aluminium P1020A, in-warehouse Rotterdam duty-paid, for delivery three months forward, $/tonne","Base Metals"]
[34013,"Aluminium P1020A, cif main Japanese ports, quarterly, $/tonne","Base Metals"]
[34015,"Aluminium P1020A, delivered US midwest, spot, $/Ib","Base Metals"]
[34025,"Nickel Melting United States Free market premium indicator $ per lb in warehouse","Base Metals"]
[34043,"Tin Kuala Lumpur Tin Market (KLTM) $ per tonne","Base Metals"]
[34044,"Tin United States New York spot, Cents per lb","Base Metals"]
[34137,"Aluminium P1020A, in-warehouse Rotterdam duty-unpaid, spot low-high monthly average, $/tonne","Base Metals"]
[34147,"Nickel Melting United States Free market premium indicator $ per lb in warehouse Monthly average","Base Metals"]
[34158,"LM24 Non-Ferrous Metals Aluminium Scrap & Foundry Ingot United Kingdom £ per tonne Monthly Average","Base Metals"]
[34159,"Aluminium Scrap and Foundry Ingots LM6/LM25 Gravity diecasting ingot United Kingdom £ per tonne Monthly average","Base Metals"]
[34186,"Copper High grade cathode United States premium indicator $ per tonne  ","Base Metals"]
[34210,"Zinc Special High Grade United States MB free market assessment $ per lb","Base Metals"]
[34211,"Copper High Grade Comex Open Interest Daily Price Cents per lb. ","Base Metals"]
[34212,"Copper High Grade Comex Spot Settlement Daily Price Cents per lb. ","Base Metals"]
[34371,"Lead High grade ingot United States premium indicator $ per lb","Base Metals"]
[34407,"Aluminium P1020A, in-warehouse Rotterdam duty-unpaid, spot low-high, $/tonne","Base Metals"]
[34410,"Aluminium 6063 extrusion billet, in-warehouse Rotterdam duty-paid, spot $/tonne","Base Metals"]
[34501,"Aluminium P1020A, in-warehouse Rotterdam duty-paid, for delivery three months forward, monthly average $/tonne","Base Metals"]
[34507,"Aluminium P1020A, in-warehouse Singapore, spot low-high, $/tonne (price discontinued)","Base Metals"]
[34509,"Aluminium Scrap and Foundry Ingots LM24 Pressure diecasting ingot United Kingdom £ per tonne","Base Metals"]
[34510,"Aluminium Scrap and Foundry Ingots LM6/LM25 Gravity diecasting ingot United Kingdom £ per tonne","Base Metals"]
[34511,"Aluminium Scrap and Foundry Ingots Aluminium pressure diecasting ingot DIN226/A380 European MB Free Market Duty paid delivered works euros per tonnes","Base Metals"]
[34512,"Singapore, copper low-high premium, Garde A, cathode, in warehouse, $ per tonne (price discontinued)","Base Metals"]
[34521,"Singapore, Zinc low-high premium, 99.995% purity, in warehouse, $ per tonne","Base Metals"]
[34523,"Copper Shanghai Futures Exchange Yuan per tonne","Base Metals"]
[34526,"Shanghai, copper low-high premium, Grade A, cathode, in warehouse $ per tonne","Base Metals"]
[34551,"Aluminium Metal Shanghai Futures Exchange Rmb/tonne ","Base Metals"]
[34558,"Copper Republican copper price for Palabora 7.90mm South Africa Rand per tonne","Base Metals"]
[34587,"Aluminium Bronze AB1 United Kingdom £ per tonne, ex-works","Base Metals"]
[34653,"Aluminium Scrap and Foundry Ingot A-380.1 alloy United States d/d Midwest $ per lb","Base Metals"]
[34694,"Nymex, Comex Stocks Copper ","Base Metals"]
[35095,"Lead MB Battery grade free market premium in warehouse € per tonne (price discontinued)","Base Metals"]
[35221,"Rotterdam, copper low-high premium, Grade A, cathode, in warehouse, $ per tonne (price discontinued)","Base Metals"]
[35380,"Aluminium P1020A, cif main Japanese ports, quarterly, monthly average $/tonne","Base Metals"]
[35385,"Aluminium P1020A, in-warehouse Rotterdam duty-paid, spot monthly average $/tonne","Base Metals"]
[35466,"Aluminium Europe Duty paid d/d works pressure diecasing ingot price DIN 226/A380 euros/tonne Monthly Average","Base Metals"]
[36097,"Codelco Producer Premium $ per tonne","Base Metals"]
[36104,"Nickel Metal Europe uncut cathodes premium indicator in warehouse Rotterdam $/tonne  ","Base Metals"]
[36105,"Nickel Metal Europe 4x4 cathodes premium indicator in warehouse Rotterdam $/tonne    ","Base Metals"]
[36106,"Nickel Metal Europe briquettes premium indicator in warehouse Rotterdam $/tonne  ","Base Metals"]
[36158,"Shanghai Aluminium Weekly Stocks Deliverable per tonne ","Base Metals"]
[36159,"Shanghai Weekly Copper Stocks Deliverable per tonne ","Base Metals"]
[36172,"Zinc Metal MB EU Special High Grade, FCA Rotterdam $ per tonne","Base Metals"]
[36188,"Alumina MB Chinese free market Metallurgical grade, delivered duty paid RMB/tonne","Base Metals"]
[36244,"Non-Ferrous Metals Zinc Metal Shanghai Futures Exchange RMB/tonne ","Base Metals"]
[36245,"Non-Ferrous Metals Zinc Metal Shanghai Zinc weekly stocks Deliverable stocks per tonne ","Base Metals"]
[36258,"Non-Ferrous Metals Lead Metal Ca/Ca grid lead (average) euros per tonne ","Base Metals"]
[36326,"Shanghai, Zinc low-high premium, 99.995% purity, in warehouse, $ per tonne","Base Metals"]
[36333," European Free Market Tin premium spot 99.9% $ per tonne  ","Base Metals"]
[36334," European Free Market Tin premium spot 99.85% $ per tonne  ","Base Metals"]
[36960,"Connector lead (average) Non-Ferrous Metals Lead Metal Connector lead (average) euros per tonne ","Base Metals"]
[37651,"Soft lead (average) Non-Ferrous Metals Lead Metal Soft Lead (average) euros per tonne ","Base Metals"]
[42047,"Non-Ferrous Metals Alumina Index Fob Australia $ per tonne  ","Base Metals"]
[42091,"Rotterdam, copper premium, Grade A, cathode, in warehouse, $ per tonne (price discontinued)","Base Metals"]
[42092,"Singapore, copper premium, Grade A cathode, in warehouse, $ per tonne (price discontinued)","Base Metals"]
[42093,"Shanghai, copper premium, Grade A, cathode, in warehouse, $ per tonne","Base Metals"]
[42102,"Leghorn, copper low-high premium, Grade A, cathode, cif, $ per tonne","Base Metals"]
[42103,"Leghorn, copper premium, Grade A, cathode, cif, $ per tonne","Base Metals"]
[42106,"South Korea, copper low-high premium, Grade A, cathode, cif, $ per tonne (formerly Busan)","Base Metals"]
[42107,"South Korea, copper premium, Grade A, cathode, cif, $ per tonne (formerly Busan)","Base Metals"]
[42113,"Aluminium P1020A, in-warehouse Rotterdam duty-unpaid, spot, $/tonne","Base Metals"]
[42114,"Aluminium P1020A, in-warehouse Singapore, spot, $/tonne (price discontinued)","Base Metals"]
[42115,"Aluminium P1020A, cif, Korea (Gwangyang or Busan), spot low-high, $/tonne","Base Metals"]
[42116,"Aluminium P1020A, cif Korea (Gwangyang or Busan), spot, $/tonne","Base Metals"]
[42117,"Aluminium P1020A, in-warehouse Johor, spot low-high, $/tonne (price discontinued)","Base Metals"]
[42118,"Aluminium P1020A, in-warehouse Johor, spot, $/tonne (price discontinued)","Base Metals"]
[42125,"Rotterdam, Lead low-high premium, 99.97% purity, in warehouse, $ per tonne (price discontinued)","Base Metals"]
[42126,"Rotterdam, lead premium, 99.97% purity, in warehouse, $ per tonne (price discontinued)","Base Metals"]
[42135,"Rotterdam, Zinc low-high premium, 99.995% purity, in warehouse, $ per tonne (price discontinued)","Base Metals"]
[42136,"Rotterdam, zinc premium, 99.995% purity in warehouse, $ per tonne (price discontinued)","Base Metals"]
[42137,"Singapore, zinc premium, 99.995% purity, in warehouse, $ per tonne","Base Metals"]
[42138,"South Korea, Zinc low-high premium, 99.995% purity, in warehouse, $ per tonne (renamed formerly Gwangyang) (price discontinued)","Base Metals"]
[42139,"South Korea, zinc premium, 99.995% purity, in warehouse, $ per tonne (renamed formerly Gwangyang) (price discontinued)","Base Metals"]
[42140,"Johor, Zinc low-high premium, 99.995% purity, in warehouse, $ per tonne (price discontinued)","Base Metals"]
[42141,"Johor, zinc premium, 99.995% purity, in warehouse, $ per tonne (price discontinued)","Base Metals"]
[42146,"Shanghai, zinc premium, 99.995% purity, in warehouse, $ per tonne","Base Metals"]
[42147,"Shanghai, Nickel low-high premium, 99.80% purity, in warehouse, $ per tonne","Base Metals"]
[42148,"Shanghai, Nickel premium, 99.80% purity, in warehouse, $ per tonne","Base Metals"]
[42149,"Aluminium P1020A, cif Shanghai, spot low-high, $/tonne","Base Metals"]
[42150,"Aluminium P1020A, cif Shanghai, spot, $/tonne","Base Metals"]
[42193,"Aluminium P1020A, in-warehouse Rotterdam duty un-paid spot, monthly average, $/tonne","Base Metals"]
[42194,"Aluminium P1020A, in-warehouse Singapore, spot low-high monthly average, $/tonne","Base Metals"]
[42195,"Aluminium P1020A, in-warehouse Singapore, spot, monthly average, $/tonne","Base Metals"]
[42200,"Aluminium P1020A, cif, Korea (Gwangyang or Busan), spot low-high monthly average, $/tonne","Base Metals"]
[42201,"Aluminium P1020A, in-warehouse Johor, spot, monthly average, $/tonne","Base Metals"]
[42202,"Aluminium P1020A, cif, Korea (Gwangyang or Busan), spot, monthly average, $/tonne","Base Metals"]
[42203,"Aluminium P1020A, in-warehouse Johor, spot low-high monthly average, $/tonne","Base Metals"]
[42206,"Aluminium P1020A, cif Shanghai, spot low-high monthly average, $/tonne","Base Metals"]
[42207,"Aluminium P1020A, cif Shanghai, spot, monthly average, $/tonne","Base Metals"]
[42208,"MB copper premium Rotterdam Grade A copper cathode to meet LME spec BSEN 1978:1998 (Cu-CATH-1) low - high monthly average $ per tonne","Base Metals"]
[42209,"MB copper premium Rotterdam Grade A copper cathode to meet LME spec BSEN 1978:1998 (Cu-CATH-1)  monthly average $ per tonne","Base Metals"]
[42214,"MB Copper Premium Busan Grade A copper cathode to meet LME spec BSEN 1978:1998 (Cu-CATH-1) low - high monthly average $ per tonne","Base Metals"]
[42215,"MB Copper Premium Busan Grade A copper cathode to meet LME spec BSEN 1978:1998 (Cu-CATH-1) monthly average $ per tonne","Base Metals"]
[42222,"MB copper premium Leghorn Grade A copper cathode to meet LME spec BSEN 1978:1998 (Cu-CATH-1) low - high monthly average $ per tonne","Base Metals"]
[42223,"MB copper premium Leghorn Grade A copper cathode to meet LME spec BSEN 1978:1998 (Cu-CATH-1) monthly average $ per tonne","Base Metals"]
[42224,"MB copper premium Shanghai Grade A copper cathode to meet LME spec BSEN 1978:1998 (Cu-CATH-1) low - high monthly average $ per tonne","Base Metals"]
[42225,"MB copper premium Shanghai Grade A copper cathode to meet LME spec BSEN 1978:1998 (Cu-CATH-1) monthly average $ per tonne","Base Metals"]
[42226,"MB copper premium Singapore Grade A copper cathode to meet LME spec BSEN 1978:1998 (Cu-CATH-1) low - high monthly average $ per tonne","Base Metals"]
[42227,"MB copper premium Singapore Grade A copper cathode to meet LME spec BSEN 1978:1998 (Cu-CATH-1) monthly average $ per tonne","Base Metals"]
[42234,"MB Lead premium Rotterdam primary lead of 99.97% purity to meet LME spec: BS EN 12659:1999 low - high monthly average $ per tonne","Base Metals"]
[42235,"MB Lead premium Rotterdam primary lead of 99.97% purity to meet LME spec: BS EN 12659:1999 calculated premium monthly average $ per tonne","Base Metals"]
[42238,"MB nickel premium Shanghai primary nickel of 99.80% to meet LME spec: B39:79 (2008) low - high monthly average $ per tonne","Base Metals"]
[42239,"MB nickel premium Shanghai primary nickel of 99.80% to meet LME spec: B39:79 (2008) calculated premium monthly average $ per tonne","Base Metals"]
[42243,"MB Zinc premium Shanghai primary zinc to meet LME spec: BS EN 1179:2003 low-high monthly average $ per tonne","Base Metals"]
[42244,"MB Zinc premium Shanghai primary zinc to meet LME spec: BS EN 1179:2003 calculated premium monthly average $ per tonne","Base Metals"]
[42247,"MB Zinc Premium Gwangyang primary zinc to meet LME spec: BS EN 1179:2003 low-high monthly average $ per tonne","Base Metals"]
[42248,"MB Zinc premium Gwangyang primary zinc to meet LME spec: BS EN 1179:2003 calculated premium monthly average $ per tonne","Base Metals"]
[42249,"MB Zinc premium Johor primary zinc to meet LME spec: BS EN 1179:2003 low-high monthly average $ per tonne","Base Metals"]
[42250,"MB Zinc premium Johor to meet LME spec: BS EN 1179:2003 calculated premium monthly average $ per tonne","Base Metals"]
[42253,"MB Zinc premium Rotterdam to meet LME spec: BS EN 1179:2003 low-high monthly average $ per tonne","Base Metals"]
[42254,"MB Zinc premium Rotterdam to meet LME spec: BS EN 1179:2003 calculated premium monthly average $ per tonne","Base Metals"]
[42255,"MB Zinc premium Singapore to meet LME spec: BS EN 1179:2003 low-high monthly average $ per tonne","Base Metals"]
[42256,"MB Zinc premium Singapore to meet LME spec: BS EN 1179:2003 calculated premium monthly average $ per tonne","Base Metals"]
[42281,"Aluminium P1020A, cif main Japanese ports, spot low-high, $/tonne","Base Metals"]
[42282,"Aluminium P1020A, cif main Japanese ports, spot, $/tonne","Base Metals"]
[42390,"European Industrial battery premium in warehouse Rotterdam free market (Eurobat) Stand-by refined or soft lead (average) € per tonne","Base Metals"]
[42391,"European Industrial battery premium in warehouse Rotterdam free market (Eurobat) Traction refined or soft lead (average) € per tonne","Base Metals"]
[42397,"Non-Ferrous Metals Alumina Index Fob Australia $ per tonne Monthly Average","Base Metals"]
[42409,"Zinc UK Special High Grade delivered customer works basis monthly average £ per tonne ","Base Metals"]
[42410,"Johor, copper low-high premium, Grade A, cathode in warehouse, $ per tonne (price discontinued)","Base Metals"]
[42411,"Johor, copper premium, Grade A, cathode, in warehouse $ per tonne (price discontinued)","Base Metals"]
[42459,"Copper Aurubis European Grade A cathode premium ex-works $ per tonne","Base Metals"]
[42474,"Nickel pig iron high grade NPI content 10-15% spot price China RMB per nickel unit price","Base Metals"]
[42475,"Nickel pig iron high grade NPI content 10-15% contract price delivered duty paid China RMB per nickel unit price","Base Metals"]
[42476,"Aluminium P1020A, delivered Sao Paulo region, spot, $/tonne","Base Metals"]
[42477,"Copper Concentrate Asia-Pacific Index TC import $ per dmt published twice monthly on 15th and last day of month","Base Metals"]
[42478,"Copper Concentrate Asia-Pacific Index RC import US cents per Ib published twice monthly on 15th and last day of month","Base Metals"]
[42479,"Nickel ore 1.8% basis cif China 15-20% Fe Water content: 30-35% Si:Mg ratio<2 Lot size 50,000 tonnes $ per tonne","Base Metals"]
[42530,"Nickel rand fixing price per tonne for LME trade","Base Metals"]
[42533,"Aluminium rand fixing price per tonne for LME trade","Base Metals"]
[42534,"Copper rand fixing price per tonne for LME trade","Base Metals"]
[42535,"Lead rand fixing price per tonne for LME trade","Base Metals"]
[42536,"Zinc rand fixing price per tonne for LME trade","Base Metals"]
[42537,"Tin rand fixing price per tonne for LME trade","Base Metals"]
[42550,"Aluminium P1020A, cif Brazilian main ports duty-unpaid, spot, $/tonne","Base Metals"]
[42560,"Shanghai, copper low-high premium, Grade A, cathode, cif, $ per tonne","Base Metals"]
[42561,"Shanghai, copper premium, Grade A, cathode, cif, $ per tonne","Base Metals"]
[43085,"Aluminium 6063 & 6060 extrusion billet, cif Brazilian main ports, spot (premium over LME cash), $/tonne","Base Metals"]
[43086,"Johor, lead premium, 99.97% purity, in warehouse, $ per tonne (price discontinued)","Base Metals"]
[43087,"Johor, lead low-high premium, 99.97% purity, in warehouse, $ per tonne (price discontinued)","Base Metals"]
[43092,"Nickel 99.80% briquettes premium in-warehouse Malaysia $/tonne (price discontinued)","Base Metals"]
[43093,"Nickel 99.80% briquettes premium in-warehouse Singapore $/tonne (price discontinued)","Base Metals"]
[43094,"Nickel 99.80% Full Plate premium in-warehouse Malaysia $/tonne (price discontinued)","Base Metals"]
[43095,"Nickel 99.80% Full Plate premium in-warehouse Singapore $/tonne (price discontinued)","Base Metals"]
[43098,"Nickel import arbitrage $ per tonne","Base Metals"]
[43099,"Nickel import arbitrage yuan per tonne","Base Metals"]
[43114,"Alumina Index, fob Brazil, adjustment to fob Australia index $ per dry metric tonne","Base Metals"]
[43116,"Aluminium extrusion billet premium 6063 Cif Japan $ per tonne","Base Metals"]
[43118,"Aluminium import arbitrage $ per tonne","Base Metals"]
[43119,"Aluminium import arbitrage yuan per tonne","Base Metals"]
[43120,"Copper import arbitrage $ per tonne","Base Metals"]
[43121,"Copper import arbitrage yuan per tonne","Base Metals"]
[43122,"Zinc import arbitrage $ per tonne","Base Metals"]
[43123,"Zinc import arbitrage yuan per tonne","Base Metals"]
[43136,"Laterite ore with 1.5% nickel content cif China $ per tonne","Base Metals"]
[43138,"Shanghai bonded copper stocks, tonnes","Base Metals"]
[43139,"Shanghai, Nickel low-high premium, 99.80% purity, full plate, cif, $ per tonne","Base Metals"]
[43140,"Shanghai, Nickel premium, 99.80% purity, full plate, cif, $ per tonne","Base Metals"]
[43145,"Aluminium ingot ADC 12 spot (MJP) $ per tonne","Base Metals"]
[43146,"Aluminium P1020A, in-warehouse Rotterdam duty-unpaid, spot, monthly average midpoint €/tonne","Base Metals"]
[43147,"Aluminium P1020A, in-warehouse Rotterdam duty-paid, spot monthly average midpoint €/tonne","Base Metals"]
[43148,"Aluminium P1020A, in-warehouse Rotterdam duty-paid, for delivery three months forward, monthly average midpoint €/tonne","Base Metals"]
[43151,"Alumina Index, fob Brazil, inferred Brazil price $ per dry metric ton","Base Metals"]
[43155,"Aluminium premium Ingots Italy duty paid FCA, $/tonne","Base Metals"]
[43157,"Ferro-nickel China premium, 26-32% nickel contained, cif China, $ per tonne","Base Metals"]
[43159,"Aluminium, P1020A, East Asian warrants, in-warehouse $/tonne","Base Metals"]
[43160,"Aluminium premium, P1020A, Singapore, FOB $/tonne","Base Metals"]
[43161,"Aluminium premium, P1020A Shanghai, in-warehouse $ per tonne","Base Metals"]
[43162,"Aluminium, P1020A, South Korea, FCA $/tonne","Base Metals"]
[43163,"Aluminium premium, P1020A, Malaysia, FOB $/tonne","Base Metals"]
[43164,"Aluminium, P1020A, Taiwan, CIF $/tonne","Base Metals"]
[43165,"Aluminium, P1020A, Antwerp, in-warehouse duty-unpaid $/tonne","Base Metals"]
[43166,"Aluminium, P1020A Antwerp in warehouse duty paid $ tonne","Base Metals"]
[43167,"Aluminium, P1020A, Vlissingen, in-warehouse duty-unpaid, spot $/tonne","Base Metals"]
[43168,"Aluminium, P1020A, Vlissingen, in-warehouse duty-paid, spot $/tonne","Base Metals"]
[43170,"Aluminium, P1020A, Spain, FCA duty-paid  $/tonne","Base Metals"]
[43171,"Aluminium, P1020A, Turkey, CIF duty-unpaid $/tonne","Base Metals"]
[43172,"Copper, Grade A cathode, East Asian warrants, in-warehouse $ per tonne","Base Metals"]
[43173,"Copper, Grade A cathode, Southeast Asia, CIF $ per tonne","Base Metals"]
[43174,"Copper, Grade A, cathode, Shanghai, CIF ER $ per tonne","Base Metals"]
[43175,"Copper, Grade A, cathode, Shanghai, bonded in-warehouse SX- EW $ per tonne","Base Metals"]
[43176,"Copper, Grade A, cathode, Shanghai, bonded in-warehouse ER $ per tonne","Base Metals"]
[43177,"Copper, Grade A, cathode, Shanghai, CIF SX- EW $ per tonne","Base Metals"]
[43178,"Copper, Grade A, cathode, Taiwan, CIF $ per tonne","Base Metals"]
[43179,"Copper Grade A, cathode, Japan, CIF $ per tonne","Base Metals"]
[43181,"Copper premium, Grade A, cathode, South European warrants, in-warehouse $ per tonne","Base Metals"]
[43182,"Copper Grade A, cathode, Germany, delivered $ per tonne","Base Metals"]
[43183,"Copper Grade A, cathode, United States Warrants $ per tonne","Base Metals"]
[43184,"Lead premium min 99.97% ingots, East Asian warrants, in-warehouse $ per tonne","Base Metals"]
[43185,"Lead premium, min 99.97%, Southeast Asian CIF $ per tonne","Base Metals"]
[43186,"Lead premium, 99.99%, Southeast Asia CIF $ per tonne","Base Metals"]
[43187,"Lead premium, 99.97% purity, Taiwan CIF  $ per tonne","Base Metals"]
[43188,"Lead premium, 99.99% purity, Taiwan CIF $ per tonne","Base Metals"]
[43189,"Lead premium, 99.97% purity, India CIF $ per tonne","Base Metals"]
[43190,"Lead premium, 99.99% purity, India CIF $ per tonne","Base Metals"]
[43191,"Lead premium, 99.97% purity, South European warrant, in-warehouse, $ per tonne","Base Metals"]
[43192,"Lead premium, 99.97% purity, Rotterdam duty paid FCA  $ per tonne","Base Metals"]
[43193,"Lead premium, 99.99% purity, Rotterdam, duty-paid FCA, $ per tonne","Base Metals"]
[43194,"Lead premium, 99.97% purity, Italy, duty paid FCA , $ per tonne","Base Metals"]
[43195,"Lead premium, 99.97% purity, United States in warehouse, warrants  $ per tonne","Base Metals"]
[43196,"Lead premium 99.99% purity, Delivered Domestic US, US cents per pound","Base Metals"]
[43197,"Nickel premium, min 99.80% full plates, East Asian warrants, in-warehouse $/tonne","Base Metals"]
[43198,"Nickel premium, min 99.80% briquettes, East Asian warrants, in-warehouse $/tonne","Base Metals"]
[43200,"Nickel plating material premium 99.8% purity, Delivered Domestic US, US cents per pound","Base Metals"]
[43201,"Tin premium, min 99.85%, ingots, Southeast Asian warrants, in-warehouse $/tonne","Base Metals"]
[43202,"Tin 99.9% Ingots  spot premium  in-warehouse Singapore $/tonne","Base Metals"]
[43203,"Tin 99.9% Low Lead Ingots  spot premium  in-warehouse Singapre $/tonne","Base Metals"]
[43204,"Tin 99.85% Ingots  spot premium  CIF Shanghai $/tonne","Base Metals"]
[43205,"Tin 99.9% Ingots  spot premium  CIF Shanghai $/tonne","Base Metals"]
[43206,"Tin 99.9% Low Lead Ingots  spot premium  CIF Shanghai $/tonne","Base Metals"]
[43207,"Tin 99.9% Ingots spot premium  CIF Taiwan $/tonne","Base Metals"]
[43208,"Tin 99.9% Low Lead spot Ingots  premium  in-warehouse Rotterdam $/tonne","Base Metals"]
[43209,"Tin premium, 99.85% ASTM grade A ingots, Baltimore in-warehouse $/tonne","Base Metals"]
[43210,"Tin premium, 99.85% ASTM grade A ingots, US Midwest Delivered, $/tonne","Base Metals"]
[43211,"Zinc premium, 99.995% purity high lead, Singapore, FCA, $ per tonne","Base Metals"]
[43212,"Zinc premium, 99.995% purity high lead, Malaysia, FCA, $ per tonne","Base Metals"]
[43213,"Zinc premium, 99.995% purity, Southeast Asia, CIF, $ per tonne","Base Metals"]
[43214,"Zinc premium, 99.995% purity, Shanghai, CIF, $ per tonne","Base Metals"]
[43215,"Zinc premium, 99.995% SHG ingots, Taiwan CIF, $ per tonne","Base Metals"]
[43216,"Zinc premium, 99.995% purity, India, CIF duty-unpaid, $ per tonne","Base Metals"]
[43217,"Zinc premium, 99.995% purity, India, CIF duty-paid, $ per tonne","Base Metals"]
[43218,"Zinc premium, 99.995% purity, Rotterdam, duty-unpaid FCA, $ per tonne","Base Metals"]
[43219,"Zinc premium, 99.995% purity, Antwerp, duty-unpaid FCA $ per tonne","Base Metals"]
[43220,"Zinc premium, 99.995% purity, Antwerp, duty paid FCA, $ per tonne","Base Metals"]
[43221,"Zinc premium, 99.995% purity, Italy duty paid, FCA, $ per tonne","Base Metals"]
[43222,"Zinc premium, 99.995% purity, Italy, delivered duty paid, $ per tonne","Base Metals"]
[43223,"Zinc premium, 99.995% purity, United States, in warehouse warrants, $ per tonne","Base Metals"]
[43230,"Aluminium premium, P1020A, US warrants, in-warehouse $/tonne","Base Metals"]
[43232,"Nickel premium, min 99.80%, North European Warrants, in-warehouse $/tonne","Base Metals"]
[43254,"Copper Cathode, Grade 1 premium, Delivered Domestic US, US cents per pound","Base Metals"]
[43255,"Aluminum, P1020 premium, delivered Midwest, US cents per pound","Base Metals"]
[43256,"Special High Grade Zinc Premium, Delivered Domestic US, US cents per pound","Base Metals"]
[43257,"Nickel melting material premium 99.8% purity, Delivered Domestic US, US cents per pound","Base Metals"]
[43258,"Lead premium 99.97% purity, Delivered Domestic US, US cents per pound","Base Metals"]
[34111,"Titanium Scrap Turnings Unprocessed (90/6/4) (0.5% Sn Max) $ per lb Cif","Scrap Metals"]
[34127,"UK domestic stainless steel scrap 12-13% Cr Solids £ per tonne del merchants","Scrap Metals"]
[34128,"UK domestic stainless steel scrap 16-17% Cr solids £ per tonne del merchants","Scrap Metals"]
[34322,"UK domestic ferrous scrap OA Plate and Structural £ per tonne del consumer","Scrap Metals"]
[34324,"UK domestic ferrous scrap 1&2 Old Steel £ per tonne del consumer","Scrap Metals"]
[34327,"UK domestic ferrous scrap 4A New Steel Bales £ per tonne del consumer","Scrap Metals"]
[34328,"UK domestic ferrous scrap 4C New Steel Bales £ per tonne del consumer","Scrap Metals"]
[34329,"UK domestic ferrous scrap 5C Loose Old Light £ per tonne del consumers","Scrap Metals"]
[34331,"UK domestic ferrous scrap 8A New Loose Light Cuttings £ per tonne del consumer","Scrap Metals"]
[34332,"UK domestic ferrous scrap 8B New Loose Light Cuttings £ per tonne del consumer","Scrap Metals"]
[34337,"UK domestic ferrous scrap 11A Cast Iron Borings (low phos) £ per tonne del consumer","Scrap Metals"]
[34344,"Ferrous scrap Rotterdam export shredded $ per tonne fob Rotterdam","Scrap Metals"]
[34386,"Aluminium Scrap and Foundry Ingots Group 1 Pure 99% & Litho United Kingdom £ per tonne","Scrap Metals"]
[34388,"Aluminium Scrap and Foundry Ingots Commercial pure cuttings United Kingdom £ per tonne","Scrap Metals"]
[34389,"Aluminium Scrap and Foundry Ingots Clean HE9 extrusions United Kingdom £ per tonne","Scrap Metals"]
[34390,"Aluminium Scrap and Foundry Ingots Loose Old Rolled cuttings United Kingdom £ per tonne","Scrap Metals"]
[34391,"Aluminium Scrap and Foundry Ingots Baled Old Rolled United Kingdom £ per tonne","Scrap Metals"]
[34392,"Aluminium Scrap and Foundry Ingots Commercial cast United Kingdom £ per tonne","Scrap Metals"]
[34393,"Aluminium Scrap and Foundry Ingots Commercial turnings United Kingdom  £ per tonne","Scrap Metals"]
[34394,"Aluminium Scrap and Foundry Ingots Group 7 turnings United Kingdom £ per tonne ","Scrap Metals"]
[34441,"Aluminium Scrap and Foundry Ingots Commercial Turnings United Kingdom MB LME Discounts ","Scrap Metals"]
[34442,"Aluminium Scrap and Foundry Ingots Group 7 Turnings United Kingdom MB LME Discounts ","Scrap Metals"]
[34597,"Titanium Scrap Turnings Unprocessed (90/6/4) (over 0.5% max 2% Sn) $ per lb cif","Scrap Metals"]
[35139,"Aluminium Scrap and Foundry Ingots Group 1 Pure 99% & Litho United Kingdom MB LME Discounts","Scrap Metals"]
[35141,"Aluminium Scrap and Foundry Ingots Commercial Pure Cuttings United Kingdom MB LME Discounts ","Scrap Metals"]
[35142,"Aluminium Scrap and Foundry Ingots Clean HE9 Extrusions United Kingdom MB LME Discounts ","Scrap Metals"]
[35143,"Aluminium Scrap and Foundry Ingots Loose Old Rolled Cuttings United Kingdom MB LME Discounts","Scrap Metals"]
[35144,"Aluminium Scrap and Foundry Ingots Baled Old Rolled United Kingdom MB LME Discounts ","Scrap Metals"]
[35145,"Aluminium Scrap and Foundry Ingots Commercial Cast United Kingdom MB LME Discounts ","Scrap Metals"]
[36108,"Aluminium Scrap Floated Frag European Free Market euros/tonne","Scrap Metals"]
[36109,"Cast European free market MB assessment  euros/tonne","Scrap Metals"]
[36110,"Mixed Turnings 6% European free market MB assessment  euros/tonne","Scrap Metals"]
[36186,"UK domestic ferrous scrap 9A/10 Heavy and Light Cast Iron £ per tonne del consumer","Scrap Metals"]
[36187,"UK domestic ferrous scrap 9B/C Cylinder Block Scrap £ per tonne del consumer","Scrap Metals"]
[36235,"China domestic heavy scrap yuan per tonne del mill","Scrap Metals"]
[36338,"Turkey import ferrous scrap HMS 1&2 (75:25 mix) $ per tonne cfr main port","Scrap Metals"]
[36339,"Turkey import ferrous scrap shredded $ per tonne cfr main Turkish port","Scrap Metals"]
[36340,"Ferrous scrap Rotterdam export  HMS 1&2 (70:30 mix) $ per tonne fob Rotterdam","Scrap Metals"]
[36439,"UK domestic 18/8 solids wholesale £ per tonne del merchants","Scrap Metals"]
[36440,"UK domestic 18/8 turnings wholesale £ per tonne del merchants","Scrap Metals"]
[37114,"Non-Ferrous Metals Copper Alloy Scrap & Foundry Ingot United Kingdom Phosphor Bronze Ingot, PB1. £ per tonne, ex-works.*","Scrap Metals"]
[37728,"Daily Metal Bulletin Ferrous scrap Index HMS 1&2 (80:20 mix) (North Europe material) $ per tonne cfr Turkey","Scrap Metals"]
[37734,"UK export ferrous scrap HMS 1&2 (80:20 mix) fob main port","Scrap Metals"]
[37735,"UK export ferrous scrap shredded $ per tonne fob main port","Scrap Metals"]
[37736,"Aluminium Scrap and Foundry Ingots Cast Wheels United Kingdom £ per tonne","Scrap Metals"]
[37737," Non-Ferrous Metals Aluminium Scrap and Foundry Ingots United Kingdom Cast wheels MB LME discount","Scrap Metals"]
[42019,"India import ferrous scrap HMS 1&2 (80:20 mix) $ per tonne cfr Nhava Sheva","Scrap Metals"]
[42024,"Metal Bulletin Ferrous Scrap Index shredded $ per tonne cfr India","Scrap Metals"]
[42025,"Metal Bulletin Ferrous Scrap Index HMS 1&2 (80:20 mix) $ per tonne fob Rotterdam","Scrap Metals"]
[42184,"Europe import 18/8 solids € per tonne cif main European port","Scrap Metals"]
[42185,"Europe import 18/8 turnings € per tonne cif main European port","Scrap Metals"]
[42296,"Turkey domestic auto bundle scrap Turkish lira per tonne delivered","Scrap Metals"]
[42297,"Turkey domestic melting scrap from shipbreaking $ per tonne delivered","Scrap Metals"]
[42437,"Scrap Indices No1 heavy melting scrap US domestic Midwest Index $ per gross ton monthly assessment","Scrap Metals"]
[42438,"Scrap Indices No1 busheling US domestic Midwest Index $ per gross ton monthly assessment","Scrap Metals"]
[42439,"Scrap Indices Shredded US domestic Midwest Index $ per gross ton monthly assessment","Scrap Metals"]
[42457,"AMM Ferrous Scrap Export Index HMS 1&2 (80:20) $ per tonne East Coast fob New York","Scrap Metals"]
[42458,"AMM Ferrous Scrap Export Index Shredded $ per tonne East Coast fob New York","Scrap Metals"]
[42485,"Germany domestic No E3 (old thick steel scrap) € per tonne delivered to German mill","Scrap Metals"]
[42486,"Daily Metal Bulletin Ferrous scrap Index HMS 1&2 (80:20 mix) (USA material) $ per tonne cfr Turkey","Scrap Metals"]
[42531,"Italy domestic No E3 (old thick scrap) € per tonne del mill","Scrap Metals"]
[42532,"Italy domestic No E8 (thin new production steel) € per tonne del mill","Scrap Metals"]
[43075,"Germany domestic grade E40 (shredded steel scrap) € per tonne del mill","Scrap Metals"]
[43076,"Germany domestic grade E8 (thin new production steel scrap) € per tonne del mill","Scrap Metals"]
[43077,"UK inter-merchant ferrous scrap 7B Heavy Steel Turnings £ per tonne delivered to export dock","Scrap Metals"]
[43078,"UK domestic ferrous scrap 12 A/C new production heavy steel £ per tonne del consumer","Scrap Metals"]
[43079,"UK domestic ferrous scrap 12 D new production clean shovellable steel £ per tonne del consumer","Scrap Metals"]
[43080,"Taiwan import ferrous scrap HMS 1&2 (80:20 mix) (USA material) $ per tonne cfr main port","Scrap Metals"]

{"sheet":"Morningstar","index":8,"n_rows":598,"n_cols":3,"rows_kept":598,"cut":false,"hidden":true,"merged":[]}
["Price_ID","Title","Package"]
[34122,"Latin America export billet $ per tonne fob main port","Steel & Raw Materials"]
[34123,"Latin America export slab $ per tonne fob main port","Steel & Raw Materials"]
[34127,"UK domestic stainless steel scrap 12-13% Cr Solids £ per tonne del merchants","Steel & Raw Materials"]
[34128,"UK domestic stainless steel scrap 16-17% Cr solids £ per tonne del merchants","Steel & Raw Materials"]
[34177,"Latin America export rebar $ per tonne fob main port","Steel & Raw Materials"]
[34178,"Latin America export merchant bar (equal angles) $ per tonne fob main port","Steel & Raw Materials"]
[34179,"Latin America export wire rod (mesh quality) $ per tonne fob main port","Steel & Raw Materials"]
[34180,"Latin America export heavy plate (thicker than 10mm) $ per tonne fob main port","Steel & Raw Materials"]
[34181,"Latin America export hot rolled coil (dry) $ per tonne fob main port","Steel & Raw Materials"]
[34182,"Latin America export cold rolled coil $ per tonne fob main port","Steel & Raw Materials"]
[34183,"Latin America export hot-dip galvanized coil $ per tonne fob main port","Steel & Raw Materials"]
[34213,"USA import rebar $ per short ton cfr Gulf","Steel & Raw Materials"]
[34214,"USA import merchant bar $ per short ton cfr Gulf","Steel & Raw Materials"]
[34215,"USA import medium sections $ per short ton cfr Gulf","Steel & Raw Materials"]
[34217,"USA import hot rolled coil (commodity grade) $ per short ton cfr Gulf","Steel & Raw Materials"]
[34219,"USA import medium plate $ per short ton cfr Gulf","Steel & Raw Materials"]
[34220,"USA import cold rolled coil $ per short ton cfr Gulf","Steel & Raw Materials"]
[34322,"UK domestic ferrous scrap OA Plate and Structural £ per tonne del consumer","Steel & Raw Materials"]
[34324,"UK domestic ferrous scrap 1&2 Old Steel £ per tonne del consumer","Steel & Raw Materials"]
[34327,"UK domestic ferrous scrap 4A New Steel Bales £ per tonne del consumer","Steel & Raw Materials"]
[34328,"UK domestic ferrous scrap 4C New Steel Bales £ per tonne del consumer","Steel & Raw Materials"]
[34329,"UK domestic ferrous scrap 5C Loose Old Light £ per tonne del consumers","Steel & Raw Materials"]
[34331,"UK domestic ferrous scrap 8A New Loose Light Cuttings £ per tonne del consumer","Steel & Raw Materials"]
[34332,"UK domestic ferrous scrap 8B New Loose Light Cuttings £ per tonne del consumer","Steel & Raw Materials"]
[34337,"UK domestic ferrous scrap 11A Cast Iron Borings (low phos) £ per tonne del consumer","Steel & Raw Materials"]
[34344,"Ferrous scrap Rotterdam export shredded $ per tonne fob Rotterdam","Steel & Raw Materials"]
[34359,"USA import wire rod (low carbon) $ per short ton cfr Gulf","Steel & Raw Materials"]
[34363,"CIS export pig iron $ per tonne fob Black/Baltic Sea (Price split into separate Baltic and Black Sea assessments effective 26/04/12)","Steel & Raw Materials"]
[34364,"CIS export billet $ per tonne fob Black Sea","Steel & Raw Materials"]
[34365,"CIS export rebar $ per tonne fob Black Sea","Steel & Raw Materials"]
[34366,"CIS export wire rod (mesh quality) $ per tonne fob Black Sea","Steel & Raw Materials"]
[34367,"CIS export slab $ per tonne fob Black Sea","Steel & Raw Materials"]
[34368,"CIS export heavy plate (10-50mm) $ per tonne fob Black Sea","Steel & Raw Materials"]
[34369,"CIS export hot rolled coil $ per tonne fob Black Sea","Steel & Raw Materials"]
[34370,"CIS export cold rolled coil $ per tonne fob Black Sea","Steel & Raw Materials"]
[34380,"Turkey export billet $ per tonne fob main port","Steel & Raw Materials"]
[34381,"Turkey export rebar $ per tonne fob main port","Steel & Raw Materials"]
[34382,"Turkey export wire rod (mesh quality) $ per tonne fob main port","Steel & Raw Materials"]
[34662,"Asia grade 304 stainless steel cold rolled coil (2mm 2B) $ per tonne cif East Asian port","Steel & Raw Materials"]
[34663,"Asia grade 304 stainless steel hot rolled sheet $ per tonne cif East Asian port","Steel & Raw Materials"]
[35276,"Europe import strip mill plate € per tonne cfr main EU port","Steel & Raw Materials"]
[35285,"Europe domestic grade 304 stainless steel cold rolled sheet (2mm) base price € per tonne del","Steel & Raw Materials"]
[36098,"Latin America exports pig iron $ per tonne fob Vitorio/Rio Brazil","Steel & Raw Materials"]
[36099,"Latin America exports pig iron $ per tonne fob Ponta da Madeira Brazil","Steel & Raw Materials"]
[36101,"Europe domestic grade 304 stainless steel cold rolled sheet (2mm) alloy surcharge € per tonne","Steel & Raw Materials"]
[36102,"Venezuelan export hot briquetted iron $ per tonne fob main port","Steel & Raw Materials"]
[36103,"USA import pig iron $ per tonne cfr Gulf","Steel & Raw Materials"]
[36112,"Southern China domestic rebar yuan per tonne ex-warehouse","Steel & Raw Materials"]
[36113,"Southern China domestic wire rod (mesh quality) yuan per tonne ex-warehouse","Steel & Raw Materials"]
[36114,"Southern China domestic cold rolled coil yuan per tonne ex-warehouse","Steel & Raw Materials"]
[36115,"Southern China domestic hot rolled coil yuan per tonne ex-warehouse","Steel & Raw Materials"]
[36116,"Eastern China domestic rebar yuan per tonne ex-warehouse","Steel & Raw Materials"]
[36117,"Eastern China domestic wire rod (mesh quality) yuan per tonne ex-warehouse","Steel & Raw Materials"]
[36118,"Eastern China domestic cold rolled coil yuan per tonne ex-warehouse","Steel & Raw Materials"]
[36119,"Eastern China domestic hot rolled coil yuan per tonne ex-warehouse","Steel & Raw Materials"]
[36162,"China export hot rolled coil $ per tonne fob main port","Steel & Raw Materials"]
[36186,"UK domestic ferrous scrap 9A/10 Heavy and Light Cast Iron £ per tonne del consumer","Steel & Raw Materials"]
[36187,"UK domestic ferrous scrap 9B/C Cylinder Block Scrap £ per tonne del consumer","Steel & Raw Materials"]
[36228,"China export heavy plate $ per tonne fob main port","Steel & Raw Materials"]
[36229,"China export galvanized coil (1mm) $ per tonne fob main port","Steel & Raw Materials"]
[36230,"China export rebar $ per tonne fob main port","Steel & Raw Materials"]
[36231,"China export wire rod (mesh quality) $ per tonne fob main port","Steel & Raw Materials"]
[36232,"China domestic grade 304 stainless steel cold rolled coil (2mm) yuan per tonne in-warehouse","Steel & Raw Materials"]
[36233,"China domestic grade 430 2mm stainless steel cold rolled coil yuan per tonne in-warehouse","Steel & Raw Materials"]
[36234,"China domestic pig iron yuan per tonne del warehouse","Steel & Raw Materials"]
[36235,"China domestic heavy scrap yuan per tonne del mill","Steel & Raw Materials"]
[36236,"Iran domestic rebar (12-25mm) million rials per tonne ex-warehouse Tehran","Steel & Raw Materials"]
[36239,"Iran domestic hot rolled plate (15-40mm) million rials per tonne ex-warehouse Tehran","Steel & Raw Materials"]
[36240,"Iran domestic hot rolled coil (2-5mm) million rials per tonne ex-warehouse Tehran","Steel & Raw Materials"]
[36241,"Iran domestic cold rolled coil (0.5-1.25mm) million rials per tonne ex-warehouse Tehran","Steel & Raw Materials"]
[36242,"Iran domestic hot-dip galvanized coil (0.4-0.9mm) million rials per tonne ex-warehouse Tehran","Steel & Raw Materials"]
[36246,"India export billet $ per tonne fob main port","Steel & Raw Materials"]
[36247,"India export heavy plate (12-40mm) $ per tonne fob main port","Steel & Raw Materials"]
[36248,"India export hot rolled coil (commodity) $ per tonne fob main port","Steel & Raw Materials"]
[36249,"India export hot-dip galvanized coil $ per tonne fob main port","Steel & Raw Materials"]
[36250,"India import heavy plate (20-60mm) $ per tonne cfr main port","Steel & Raw Materials"]
[36251,"Indian domestic billet rupees per tonne ex-works","Steel & Raw Materials"]
[36253,"India domestic heavy plate rupees per tonne exw","Steel & Raw Materials"]
[36254,"India domestic hot rolled coil rupees per tonne exw","Steel & Raw Materials"]
[36255,"India domestic hot-dip galvanized coil rupees per tonne exw","Steel & Raw Materials"]
[36256,"India import hot rolled coil $ per tonne cfr main port","Steel & Raw Materials"]
[36263,"UAE import billet $ per tonne cfr Jebel Ali","Steel & Raw Materials"]
[36264,"UAE import rebar $ per tonne cfr Jebel Ali","Steel & Raw Materials"]
[36265,"UAE import hot rolled coil $ per tonne cfr Jebel Ali","Steel & Raw Materials"]
[36266,"UAE import cold rolled coil $ per tonne cfr Jebel Ali","Steel & Raw Materials"]
[36268,"Iran import billet $ per tonne cfr northern ports","Steel & Raw Materials"]
[36269,"India domestic cold rolled coil rupees per tonne ex-works","Steel & Raw Materials"]
[36273,"Turkey domestic billet $ per tonne exw","Steel & Raw Materials"]
[36274,"Turkey domestic rebar $ per tonne exw","Steel & Raw Materials"]
[36275,"Turkey domestic wire rod (mesh quality) $ per tonne exw","Steel & Raw Materials"]
[36276,"Turkey import billet $ per tonne cfr main port","Steel & Raw Materials"]
[36277,"Turkey import hot rolled coil $ per tonne cfr main port","Steel & Raw Materials"]
[36278,"USA domestic rebar $ per short ton fob mill","Steel & Raw Materials"]
[36279,"USA domestic wire rod (mesh quality) $ per short ton fob mill","Steel & Raw Materials"]
[36280,"USA domestic plate (up to 4 inches) $ per short ton fob mill","Steel & Raw Materials"]
[36281,"USA domestic hot rolled sheet  $ per short ton fob mill","Steel & Raw Materials"]
[36282,"USA domestic cold rolled sheet $ per short ton fob mill","Steel & Raw Materials"]
[36284,"Europe domestic plate (up to 10mm) € per tonne del","Steel & Raw Materials"]
[36286,"Southern China domestic sections yuan per tonne ex-warehouse","Steel & Raw Materials"]
[36287,"Southern China domestic plate yuan per tonne ex-warehouse","Steel & Raw Materials"]
[36288,"Southern China domestic hot-dip galvanized coil yuan per tonne ex-warehouse","Steel & Raw Materials"]
[36289,"Eastern China domestic sections yuan per tonne ex-warehouse","Steel & Raw Materials"]
[36290,"Eastern China domestic plate yuan per tonne ex-warehouse","Steel & Raw Materials"]
[36291,"Eastern China domestic hot-dip galvanized coil yuan per tonne ex-warehouse","Steel & Raw Materials"]
[36292,"Turkey domestic hot rolled coil $ per tonne exw","Steel & Raw Materials"]
[36293,"Turkey domestic cold rolled coil $ per tonne exw","Steel & Raw Materials"]
[36306,"Turkey import cold rolled coil $ per tonne cfr main port","Steel & Raw Materials"]
[36324,"Turkey export merchant bar $ per tonne fob main Turkish port","Steel & Raw Materials"]
[36327,"Europe domestic grade 304 stainless steel bright bar base price € per tonne del","Steel & Raw Materials"]
[36328,"Europe domestic grade 304 stainless steel bright bar alloy surcharge € per tonne","Steel & Raw Materials"]
[36331,"Egypt domestic rebar E£ per tonne exw","Steel & Raw Materials"]
[36332,"India domestic direct reduced iron rupees per tonne exw","Steel & Raw Materials"]
[36338,"Turkey import ferrous scrap HMS 1&2 (75:25 mix) $ per tonne cfr main port","Steel & Raw Materials"]
[36339,"Turkey import ferrous scrap shredded $ per tonne cfr main Turkish port","Steel & Raw Materials"]
[36340,"Ferrous scrap Rotterdam export  HMS 1&2 (70:30 mix) $ per tonne fob Rotterdam","Steel & Raw Materials"]
[36439,"UK domestic 18/8 solids wholesale £ per tonne del merchants","Steel & Raw Materials"]
[36440,"UK domestic 18/8 turnings wholesale £ per tonne del merchants","Steel & Raw Materials"]
[36994,"Iran import rebar $ per tonne cfr northern port","Steel & Raw Materials"]
[37644,"India import cold rolled coil $ per tonne cfr main port","Steel & Raw Materials"]
[37728,"Daily Metal Bulletin Ferrous scrap Index HMS 1&2 (80:20 mix) (North Europe material) $ per tonne cfr Turkey","Steel & Raw Materials"]
[37729,"China export cold rolled coil $ per tonne fob main port","Steel & Raw Materials"]
[37734,"UK export ferrous scrap HMS 1&2 (80:20 mix) fob main port","Steel & Raw Materials"]
[37735,"UK export ferrous scrap shredded $ per tonne fob main port","Steel & Raw Materials"]
[42019,"India import ferrous scrap HMS 1&2 (80:20 mix) $ per tonne cfr Nhava Sheva","Steel & Raw Materials"]
[42024,"Metal Bulletin Ferrous Scrap Index shredded $ per tonne cfr India","Steel & Raw Materials"]
[42025,"Metal Bulletin Ferrous Scrap Index HMS 1&2 (80:20 mix) $ per tonne fob Rotterdam","Steel & Raw Materials"]
[42048,"Index of spot market Iron Ore prices delivered to China, normalized to Qingdao and 62% Fe US $ per tonne Daily","Steel & Raw Materials"]
[42111,"(MBIOI-58) Iron Ore Index CFR Qingdao on a 58% fe basis Daily Price $ per dry metric tonne","Steel & Raw Materials"]
[42152,"India import hot rolled coil (CR grade) $ per tonne cfr main port","Steel & Raw Materials"]
[42153,"EU import rebar € per tonne cfr main EU port Southern Europe","Steel & Raw Materials"]
[42154,"EU import wire rod (mesh quality) € per tonne cfr main EU port Southern Europe","Steel & Raw Materials"]
[42155,"EU import Plate (8-40mm) € per tonne cfr main EU port Southern Europe","Steel & Raw Materials"]
[42156,"EU import Hot rolled coil € per tonne cfr main EU port Southern Europe","Steel & Raw Materials"]
[42157,"EU import cold rolled coil € per tonne cfr main EU port Southern Europe","Steel & Raw Materials"]
[42158,"EU import hot-dip galvanized coil € per tonne cfr main EU port Southern Europe","Steel & Raw Materials"]
[42159,"EU import rebar € per tonne cfr main EU port Northern Europe","Steel & Raw Materials"]
[42160,"EU import wire rod (mesh quality) € per tonne cfr main EU port Northern Europe","Steel & Raw Materials"]
[42161,"EU import Plate (8-40mm) € per tonne cfr main EU port Northern Europe","Steel & Raw Materials"]
[42162,"EU import Hot rolled coil € per tonne cfr main EU port Northern Europe","Steel & Raw Materials"]
[42163,"EU import cold rolled coil € per tonne cfr main EU port Northern Europe","Steel & Raw Materials"]
[42164,"EU import hot-dip galvanized coil € per tonne cfr main EU port Northern Europe","Steel & Raw Materials"]
[42165,"EU domestic rebar € per tonne del Southern Europe","Steel & Raw Materials"]
[42166,"EU domestic wire rod (mesh quality) € per tonne del Southern Europe","Steel & Raw Materials"]
[42167,"EU domestic hollow sections € per tonne del Southern Europe","Steel & Raw Materials"]
[42168,"EU domestic plate (8-40mm) € per tonne ex-works Southern Europe","Steel & Raw Materials"]
[42169,"EU domestic hot rolled coil € per tonne ex-works Southern Europe","Steel & Raw Materials"]
[42170,"EU domestic cold rolled coil € per tonne ex-works Southern Europe","Steel & Raw Materials"]
[42171,"EU domestic hot-dip galvanized coil € per tonne ex-works Southern Europe","Steel & Raw Materials"]
[42172,"EU domestic rebar € per tonne del Northern Europe","Steel & Raw Materials"]
[42173,"EU domestic wire rod (mesh quality) € per tonne del Northern Europe","Steel & Raw Materials"]
[42174,"EU domestic hollow sections € per tonne del Northern Europe","Steel & Raw Materials"]
[42175,"EU domestic plate (8-40mm) € per tonne ex-works Northern Europe","Steel & Raw Materials"]
[42176,"EU domestic hot rolled coil € per tonne ex-works Northern Europe","Steel & Raw Materials"]
[42177,"EU domestic cold rolled coil € per tonne ex-works Northern Europe","Steel & Raw Materials"]
[42178,"EU domestic hot-dip galvanized coil € per tonne ex-works Northern Europe","Steel & Raw Materials"]
[42179,"Southern Europe export rebar € per tonne fob main port","Steel & Raw Materials"]
[42180,"Southern Europe export wire rod (mesh quality) € per tonne fob main port","Steel & Raw Materials"]
[42181,"CIS export pig iron Baltic Sea $ per tonne fob main port","Steel & Raw Materials"]
[42182,"CIS export pig iron Black Sea $ per tonne fob main port","Steel & Raw Materials"]
[42183,"EU export grade 304 stainless steel cold rolled sheet (2mm) € per tonne fob North European port","Steel & Raw Materials"]
[42184,"Europe import 18/8 solids € per tonne cif main European port","Steel & Raw Materials"]
[42185,"Europe import 18/8 turnings € per tonne cif main European port","Steel & Raw Materials"]
[42296,"Turkey domestic auto bundle scrap Turkish lira per tonne delivered","Steel & Raw Materials"]
[42297,"Turkey domestic melting scrap from shipbreaking $ per tonne delivered","Steel & Raw Materials"]
[42299,"EU domestic Northern Region hollow sections € per tonne ex-works","Steel & Raw Materials"]
[42300,"EU domestic Southern Region hollow sections € per tonne ex-works","Steel & Raw Materials"]
[42301,"Iron Ore Pellet Index cfr Qingdao (65% Fe) $ per dry metric tonne weekly index","Steel & Raw Materials"]
[42302,"Iron Ore Concentrate Index (66% Fe) cfr Qingdao $ per dry metric tonne weekly index","Steel & Raw Materials"]
[42303,"Turkey export hot rolled coil $ per tonne fob main port","Steel & Raw Materials"]
[42305,"South America plate import $ per tonne cfr main ports","Steel & Raw Materials"]
[42306,"South America import hot rolled coil $ per tonne cfr main ports","Steel & Raw Materials"]
[42307,"South America import cold rolled coil $ per tonne cfr main ports","Steel & Raw Materials"]
[42309,"India domestic rebar rupees per tonne ex works","Steel & Raw Materials"]
[42310,"Metal Bulletin Indicator for US$/% Fe in Iron Ore Fines cfr Qingdao","Steel & Raw Materials"]
[42384,"Iran import hot rolled coil $ per tonne cfr Iranian ports","Steel & Raw Materials"]
[42385,"Iran import cold rolled coil $ per tonne cfr Iranian ports","Steel & Raw Materials"]
[42387,"Iran import plate $ per tonne cfr Iranian ports","Steel & Raw Materials"]
[42389,"Iran domestic billet million rials per tonne ex stock Tehran","Steel & Raw Materials"]
[42393,"EU domestic 316 2mm cold rolled stainless sheet base price delivered € per tonne","Steel & Raw Materials"]
[42394,"EU domestic 316 2mm cold rolled stainless sheet alloy surcharge delivered € per tonne","Steel & Raw Materials"]
[42399,"China Hard Coking Coal Shanxi spot market domestic delivered Yuan per tonne ","Steel & Raw Materials"]
[42400,"Northern China Tangshan Domestic Billet ex-works Yuan per tonne","Steel & Raw Materials"]
[42401,"Northern China Domestic Rebar ex-warehouse Yuan per tonne","Steel & Raw Materials"]
[42402,"Northern China Domestic Hot Rolled Coil ex-warehouse Yuan per tonne","Steel & Raw Materials"]
[42403,"Poland domestic rebar ex-works zloty per tonne","Steel & Raw Materials"]
[42405,"Brazil domestic rebar delivered Reais per tonne monthly","Steel & Raw Materials"]
[42406,"Brazil domestic hot rolled coil ex-works Reais per tonne monthly ","Steel & Raw Materials"]
[42407,"Brazil domestic cold rolled coil ex-works Reais per tonne monthly ","Steel & Raw Materials"]
[42412,"South East Asia/East Asia import slab $ per tonne cfr","Steel & Raw Materials"]
[42413,"South East Asia Import Billet $ per tonne cfr","Steel & Raw Materials"]
[42414,"South East Asia Import Hot rolled coil $ per tonne cfr (Vietnam)","Steel & Raw Materials"]
[42415,"South East Asia Import Cold rolled coil $ per tonne cfr","Steel & Raw Materials"]
[42417,"South East Asia Import Rebar $ per tonne cfr (Singapore)","Steel & Raw Materials"]
[42418,"South East Asia Import Wire rod (low carbon) $ per tonne cfr","Steel & Raw Materials"]
[42419,"Saudi Arabia import rebar $ per tonne cfr","Steel & Raw Materials"]
[42420,"Saudi Arabia import hot rolled coil $ per tonne cfr","Steel & Raw Materials"]
[42421,"Peru domestic rebar ex-works Peruvian Nuevos Soles per tonne monthly assessment","Steel & Raw Materials"]
[42423,"Argentina domestic hot rolled coil ex-works $ per tonne monthly assessment","Steel & Raw Materials"]
[42424,"Argentina domestic cold rolled coil ex-works $ per tonne monthly assessment","Steel & Raw Materials"]
[42426,"USA grade 304 stainless steel coiled plate $ per hundredweight fob mill monthly assessment","Steel & Raw Materials"]
[42427,"USA grade 316 stainless steel coiled plate $ per hundredweight fob mill monthly assessment","Steel & Raw Materials"]
[42428,"USA grade 304 stainless steel cold rolled sheet $ per hundredweight fob mill monthly assessment","Steel & Raw Materials"]
[42429,"USA grade 316L stainless steel cold rolled sheet $ per hundredweight fob mill monthly assessment","Steel & Raw Materials"]
[42430,"USA domestic ERW linepipe (X42) $ per short ton fob mill monthly assessment","Steel & Raw Materials"]
[42431,"USA import ERW linepipe (X42) c&f $ per short ton monthly assessment","Steel & Raw Materials"]
[42432,"USA import OCTG API5CT - casing J/K55 c&f $ per short ton delivered monthly assessment","Steel & Raw Materials"]
[42433,"USA OCTG API5CT - casing J/K55 $ per short ton fob mill monthly assessment","Steel & Raw Materials"]
[42434,"Russian domestic rebar rubles per tonne carriage paid (cpt) inc VAT","Steel & Raw Materials"]
[42435,"Russian domestic hot rolled sheet rubles per tonne carriage paid (cpt) inc VAT","Steel & Raw Materials"]
[42436,"Russian domestic Cold rolled sheet rubles per tonne carriage paid (cpt) inc VAT","Steel & Raw Materials"]
[42437,"Scrap Indices No1 heavy melting scrap US domestic Midwest Index $ per gross ton monthly assessment","Steel & Raw Materials"]
[42438,"Scrap Indices No1 busheling US domestic Midwest Index $ per gross ton monthly assessment","Steel & Raw Materials"]
[42439,"Scrap Indices Shredded US domestic Midwest Index $ per gross ton monthly assessment","Steel & Raw Materials"]
[42440,"USA import hot-dipped galvanized 0.012-0.015 G30 cif Houston $ per short ton","Steel & Raw Materials"]
[42441,"USA import hot-dipped galvanized 0.019 G60 cif Houston $ per short ton","Steel & Raw Materials"]
[42442,"Turkey domestic hot dip galvanized $ per tonne ex-works","Steel & Raw Materials"]
[42443,"USA domestic merchant bar 3 x 3 1/4 angle $ per hundredweight fob mill","Steel & Raw Materials"]
[42444,"MB Steel First Coking Coal Index - Premium Hard Coking Coal $ per tonne CFR Jingtang","Steel & Raw Materials"]
[42445,"MB Steel First Coking Coal Index - Hard Coking Coal $ per tonne CFR Jingtang","Steel & Raw Materials"]
[42446,"MB Steel First Coking Coal Index - Premium Hard Coking Coal $ per tonne FOB DBCT","Steel & Raw Materials"]
[42447,"MB Steel First Coking Coal Index - Hard Coking Coal $ per tonne FOB DBCT","Steel & Raw Materials"]
[42457,"AMM Ferrous Scrap Export Index HMS 1&2 (80:20) $ per tonne East Coast fob New York","Steel & Raw Materials"]
[42458,"AMM Ferrous Scrap Export Index Shredded $ per tonne East Coast fob New York","Steel & Raw Materials"]
[42462,"EU domestic Stainless Steel 304 Europe Raw Materials Index $ per tonne","Steel & Raw Materials"]
[42463,"Shanghai Futures Exchange rebar yuan per tonne settlement Month 1","Steel & Raw Materials"]
[42464,"Shanghai Futures Exchange rebar yuan per tonne settlement Month 2","Steel & Raw Materials"]
[42465,"Shanghai Futures Exchange rebar yuan per tonne settlement Month 3","Steel & Raw Materials"]
[42466,"Shanghai Futures Exchange rebar weekly inventories, tonnes","Steel & Raw Materials"]
[42467,"UAE domestic rebar UAE dirhams per tonne exw","Steel & Raw Materials"]
[42480,"EU domestic beams € per tonne del Southern Europe","Steel & Raw Materials"]
[42481,"EU domestic beams € per tonne del Northern Europe","Steel & Raw Materials"]
[42482,"EU domestic beams € per tonne ex-works Northern Europe","Steel & Raw Materials"]
[42483,"EU domestic beams € per tonne ex-works Southern Europe","Steel & Raw Materials"]
[42484,"Turkey export S235JR grade EN10219 2mm wall thickness structural pipe $ per tonne fob main port","Steel & Raw Materials"]
[42485,"Germany domestic No E3 scrap € per tonne delivered to German mill","Steel & Raw Materials"]
[42486,"Daily Metal Bulletin Ferrous scrap Index HMS 1&2 (80:20 mix) (USA material) $ per tonne cfr Turkey","Steel & Raw Materials"]
[42529,"AMM USA domestic Hot-dipped galvanized (base) price $ per short ton Midwest market price fob mill","Steel & Raw Materials"]
[42546,"Argentina domestic rebar ex-works $ per tonne monthly assessment","Steel & Raw Materials"]
[42552,"Iron Ore 62% Fe China port price index","Steel & Raw Materials"]
[42559,"EU pig iron imports $ per tonne cif Italy","Steel & Raw Materials"]
[42994,"Metal Bulletin 58% Fe Iron Ore Index (MBIOI-58) CFR Qingdao on a 58% fe basis Daily Price $ per dry metric tonne","Steel & Raw Materials"]
[42995," High grade Premium (MBIOI-58P) CFR Qingdao on a 58% basis low alumina, low phosphorous Daily Price $ per dry metric tonne","Steel & Raw Materials"]
[43048,"Metal Bulletins lump premium CFR Qingdao (MBIOI-LP Index) cents per dmtu daily","Steel & Raw Materials"]
[43049,"Metal Bulletins 65% Fe Brazilian Index CFR Qingdao (MBIOI-65-BZ-Index) $ per tonne published daily from Sept 1 this is now a price","Steel & Raw Materials"]
[43050,"Metal Bulletin Indicator for US$/% Si MBIOI Si-VIU cfr Qingdao Monthly indicator","Steel & Raw Materials"]
[43064,"Metal Bulletin Indicator for US$/% Al MBIOI Al-VIU cfr Qingdao Monthly indicator","Steel & Raw Materials"]
[43072,"Implied 62% Fe China Port Price $ per tonne","Steel & Raw Materials"]
[43073,"Iron Ore Fines 65% Fe, % Fe value in use cfr Qingdao $ per dry metric tonne","Steel & Raw Materials"]
[43075,"Germany domestic grade E40 (shredded steel scrap) € per tonne del mill","Steel & Raw Materials"]
[43076,"Germany domestic grade E8 (thin new production steel scrap) € per tonne del mill","Steel & Raw Materials"]
[43077,"UK inter-merchant ferrous scrap 7B Heavy Steel Turnings £ per tonne delivered to export dock","Steel & Raw Materials"]
[43078,"UK domestic ferrous scrap 12 A/C new production heavy steel £ per tonne del consumer","Steel & Raw Materials"]
[43079,"UK domestic ferrous scrap 12 D new production clean shovellable steel £ per tonne del consumer","Steel & Raw Materials"]
[43080,"Taiwan import ferrous scrap HMS 1&2 (80:20 mix) (USA material) $ per tonne cfr main port","Steel & Raw Materials"]
[43082,"Russian domestic plate rubles per tonne carriage paid (cpt) inc VAT","Steel & Raw Materials"]
[43083,"Egypt import billet $ per tonne cfr main port","Steel & Raw Materials"]
[43084,"Steel First 65% CSR Coke $ per tonne FOB Tianjin","Steel & Raw Materials"]
[43088,"Iron Ore Fines 62% Fe, 0.01% Phosphorous value in use MBIOI Phos-VIU cfr Qingdao US cent per dry metric tonne","Steel & Raw Materials"]
[43096,"Algeria import rebar € per tonne cfr main port","Steel & Raw Materials"]
[43097,"Metal Bulletin 60% Fe Iranian Fines Index (MBIOI-IR) CFR China US $ per tonne","Steel & Raw Materials"]
[34111,"Titanium Scrap Turnings Unprocessed (90/6/4) (0.5% Sn Max) $ per lb Cif","Scrap"]
[34127,"UK domestic stainless steel scrap 12-13% Cr Solids £ per tonne del merchants","Scrap"]
[34128,"UK domestic stainless steel scrap 16-17% Cr solids £ per tonne del merchants","Scrap"]
[34322,"UK domestic ferrous scrap OA Plate and Structural £ per tonne del consumer","Scrap"]
[34324,"UK domestic ferrous scrap 1&2 Old Steel £ per tonne del consumer","Scrap"]
[34327,"UK domestic ferrous scrap 4A New Steel Bales £ per tonne del consumer","Scrap"]
[34328,"UK domestic ferrous scrap 4C New Steel Bales £ per tonne del consumer","Scrap"]
[34329,"UK domestic ferrous scrap 5C Loose Old Light £ per tonne del consumers","Scrap"]
[34331,"UK domestic ferrous scrap 8A New Loose Light Cuttings £ per tonne del consumer","Scrap"]
[34332,"UK domestic ferrous scrap 8B New Loose Light Cuttings £ per tonne del consumer","Scrap"]
[34337,"UK domestic ferrous scrap 11A Cast Iron Borings (low phos) £ per tonne del consumer","Scrap"]
[34344,"Ferrous scrap Rotterdam export shredded $ per tonne fob Rotterdam","Scrap"]
[34386,"Aluminium Scrap and Foundry Ingots Group 1 Pure 99% & Litho United Kingdom £ per tonne","Scrap"]
[34388,"Aluminium Scrap and Foundry Ingots Commercial pure cuttings United Kingdom £ per tonne","Scrap"]
[34389,"Aluminium Scrap and Foundry Ingots Clean HE9 extrusions United Kingdom £ per tonne","Scrap"]
[34390,"Aluminium Scrap and Foundry Ingots Loose Old Rolled cuttings United Kingdom £ per tonne","Scrap"]
[34391,"Aluminium Scrap and Foundry Ingots Baled Old Rolled United Kingdom £ per tonne","Scrap"]
[34392,"Aluminium Scrap and Foundry Ingots Commercial cast United Kingdom £ per tonne","Scrap"]
[34393,"Aluminium Scrap and Foundry Ingots Commercial turnings United Kingdom  £ per tonne","Scrap"]
[34394,"Aluminium Scrap and Foundry Ingots Group 7 turnings United Kingdom £ per tonne ","Scrap"]
[34441,"Aluminium Scrap and Foundry Ingots Commercial Turnings United Kingdom MB LME Discounts ","Scrap"]
[34442,"Aluminium Scrap and Foundry Ingots Group 7 Turnings United Kingdom MB LME Discounts ","Scrap"]
[34597,"Titanium Scrap Turnings Unprocessed (90/6/4) (over 0.5% max 2% Sn) $ per lb cif","Scrap"]
[35139,"Aluminium Scrap and Foundry Ingots Group 1 Pure 99% & Litho United Kingdom MB LME Discounts","Scrap"]
[35141,"Aluminium Scrap and Foundry Ingots Commercial Pure Cuttings United Kingdom MB LME Discounts ","Scrap"]
[35142,"Aluminium Scrap and Foundry Ingots Clean HE9 Extrusions United Kingdom MB LME Discounts ","Scrap"]
[35143,"Aluminium Scrap and Foundry Ingots Loose Old Rolled Cuttings United Kingdom MB LME Discounts","Scrap"]
[35144,"Aluminium Scrap and Foundry Ingots Baled Old Rolled United Kingdom MB LME Discounts ","Scrap"]
[35145,"Aluminium Scrap and Foundry Ingots Commercial Cast United Kingdom MB LME Discounts ","Scrap"]
[36108,"Aluminium Scrap Floated Frag European Free Market euros/tonne","Scrap"]
[36109,"Cast European free market MB assessment  euros/tonne","Scrap"]
[36110,"Mixed Turnings 6% European free market MB assessment  euros/tonne","Scrap"]
[36186,"UK domestic ferrous scrap 9A/10 Heavy and Light Cast Iron £ per tonne del consumer","Scrap"]
[36187,"UK domestic ferrous scrap 9B/C Cylinder Block Scrap £ per tonne del consumer","Scrap"]
[36235,"China domestic heavy scrap yuan per tonne del mill","Scrap"]
[36338,"Turkey import ferrous scrap HMS 1&2 (75:25 mix) $ per tonne cfr main port","Scrap"]
[36339,"Turkey import ferrous scrap shredded $ per tonne cfr main Turkish port","Scrap"]
[36340,"Ferrous scrap Rotterdam export  HMS 1&2 (70:30 mix) $ per tonne fob Rotterdam","Scrap"]
[36439,"UK domestic 18/8 solids wholesale £ per tonne del merchants","Scrap"]
[36440,"UK domestic 18/8 turnings wholesale £ per tonne del merchants","Scrap"]
[37114,"Non-Ferrous Metals Copper Alloy Scrap & Foundry Ingot United Kingdom Phosphor Bronze Ingot, PB1. £ per tonne, ex-works.*","Scrap"]
[37728,"Daily Metal Bulletin Ferrous scrap Index HMS 1&2 (80:20 mix) (North Europe material) $ per tonne cfr Turkey","Scrap"]
[37734,"UK export ferrous scrap HMS 1&2 (80:20 mix) fob main port","Scrap"]
[37735,"UK export ferrous scrap shredded $ per tonne fob main port","Scrap"]
[37736,"Aluminium Scrap and Foundry Ingots Cast Wheels United Kingdom £ per tonne","Scrap"]
[37737," Non-Ferrous Metals Aluminium Scrap and Foundry Ingots United Kingdom Cast wheels MB LME discount","Scrap"]
[42019,"India import ferrous scrap HMS 1&2 (80:20 mix) $ per tonne cfr Nhava Sheva","Scrap"]
[42024,"Metal Bulletin Ferrous Scrap Index shredded $ per tonne cfr India","Scrap"]
[42025,"Metal Bulletin Ferrous Scrap Index HMS 1&2 (80:20 mix) $ per tonne fob Rotterdam","Scrap"]
[42184,"Europe import 18/8 solids € per tonne cif main European port","Scrap"]
[42185,"Europe import 18/8 turnings € per tonne cif main European port","Scrap"]
[42296,"Turkey domestic auto bundle scrap Turkish lira per tonne delivered","Scrap"]
[42297,"Turkey domestic melting scrap from shipbreaking $ per tonne delivered","Scrap"]
[42437,"Scrap Indices No1 heavy melting scrap US domestic Midwest Index $ per gross ton monthly assessment","Scrap"]
[42438,"Scrap Indices No1 busheling US domestic Midwest Index $ per gross ton monthly assessment","Scrap"]
[42439,"Scrap Indices Shredded US domestic Midwest Index $ per gross ton monthly assessment","Scrap"]
[42457,"AMM Ferrous Scrap Export Index HMS 1&2 (80:20) $ per tonne East Coast fob New York","Scrap"]
[42458,"AMM Ferrous Scrap Export Index Shredded $ per tonne East Coast fob New York","Scrap"]
[42485,"Germany domestic No E3 scrap € per tonne delivered to German mill","Scrap"]
[42486,"Daily Metal Bulletin Ferrous scrap Index HMS 1&2 (80:20 mix) (USA material) $ per tonne cfr Turkey","Scrap"]
[42531,"Italy domestic No E3 (old thick scrap) € per tonne del mill","Scrap"]
[42532,"Italy domestic No E8 (thin new production steel) € per tonne del mill","Scrap"]
[43075,"Germany domestic grade E40 (shredded steel scrap) € per tonne del mill","Scrap"]
[43076,"Germany domestic grade E8 (thin new production steel scrap) € per tonne del mill","Scrap"]
[43077,"UK inter-merchant ferrous scrap 7B Heavy Steel Turnings £ per tonne delivered to export dock","Scrap"]
[43078,"UK domestic ferrous scrap 12 A/C new production heavy steel £ per tonne del consumer","Scrap"]
[43079,"UK domestic ferrous scrap 12 D new production clean shovellable steel £ per tonne del consumer","Scrap"]
[43080,"Taiwan import ferrous scrap HMS 1&2 (80:20 mix) (USA material) $ per tonne cfr main port","Scrap"]
[34018,"Indium, Indium Corp ingots min 99.97% $ per kg, fob","Alloys & Minor Metals"]
[34021,"Molybdenum Canned molybdic oxide United States Free market $ per lb Mo in warehouse","Alloys & Minor Metals"]
[34022,"Molybdenum Drummed molybdic oxide Free market $ per lb Mo in warehouse","Alloys & Minor Metals"]
[34033,"Ruthenium min. 99.9% European free market $ per troy oz in warehouse","Alloys & Minor Metals"]
[34065,"Ferro-chrome lumpy Cr charge, basis 52% Cr quarterly major European destinations $ per Ib Cr","Alloys & Minor Metals"]
[34066,"Ferro-chrome 6-8% C basis 60% Cr max. 1.5% Si major European destinations $ per lb Cr","Alloys & Minor Metals"]
[34067,"Ferro-chrome 0.10% C average 60-70% Cr major European destinations $ per lb Cr","Alloys & Minor Metals"]
[34068,"Ferro-manganese basis 78% Mn (Scale pro rata) - Standard 7.5% C major European destinations € per tonne","Alloys & Minor Metals"]
[34069,"Ferro-silicon lumpy basis 75% Si (Scale pro rata) major European destinations € per tonne","Alloys & Minor Metals"]
[34070,"Silico-manganese lumpy 65-75% Mn basis 15-19% Si (Scale pro rata) major European destinations Euro per tonne","Alloys & Minor Metals"]
[34071,"Ferro-molybdenum basis 65% min, in-warehouse Rotterdam, $ per kg Mo","Alloys & Minor Metals"]
[34072,"Ferro-tungsten basis 75% W Rotterdam duty unpaid $ per kg W in warehouse ","Alloys & Minor Metals"]
[34073,"Ferro-vanadium basis 78% min, free delivered duty paid, consumer plant,1st grade Western Europe, $ per kg V","Alloys & Minor Metals"]
[34088,"Vanadium pentoxide min 98%, in-warehouse Rotterdam $ per lb V2O5","Alloys & Minor Metals"]
[34089,"Zirconium Ore Foundry grade bulk Europe $ per tonne fob","Alloys & Minor Metals"]
[34090,"Zirconium Ore Premium bulk Europe $ per tonne fob","Alloys & Minor Metals"]
[34138,"Antimony MB free market in warehouse $ per tonne Monthly average ","Alloys & Minor Metals"]
[34139,"Bismuth MB free market tonne lots in warehouse $ per lb Monthly average ","Alloys & Minor Metals"]
[34143,"Molybdenum Drummed molybdic oxide Free market $ per lb Mo in warehouse Monthly average","Alloys & Minor Metals"]
[34144,"Molybdenum canned molybdic oxide United States Free market $ per lb Mo in warehouse Monthly average ","Alloys & Minor Metals"]
[34153,"Selenium MB free market $ per lb in warehouse Monthly average","Alloys & Minor Metals"]
[34161,"Vanadium pentoxide min 98%, in-warehouse Rotterdam monthly average $ per lb V2O5","Alloys & Minor Metals"]
[34188,"Silicon United States Free market Cents per lb","Alloys & Minor Metals"]
[34209,"Chromium World MB free market alumino-thermic min 99% $/tonne in warehouse","Alloys & Minor Metals"]
[34222,"Indium Ingots MB free market Monthly Average in warehouse $ per kg","Alloys & Minor Metals"]
[34236,"Ferro-chrome 6-8% C basis 60-65% Cr max 2% Si United States free market in warehouse Pittsburgh $ per lb Cr","Alloys & Minor Metals"]
[34238,"Ferro-manganese 78% Mn standard 7.5% C United States free market in warehouse Pittsburgh $ per long ton ","Alloys & Minor Metals"]
[34239,"Ferro-silicon Lumpy basis 75% Si, United States Free market, imported, in warehouse Pittsburgh. $ per lb","Alloys & Minor Metals"]
[34242,"Silico-manganese United States Free Market in warehouse Pittsburgh $ per lb","Alloys & Minor Metals"]
[34247,"Tungsten APT European free market $ per mtu","Alloys & Minor Metals"]
[34248,"Antimony MB free market $ per tonne in warehouse Rotterdam max 100 ppm Bi","Alloys & Minor Metals"]
[34249,"Bismuth MB free market tonne lots in warehouse $ per lb","Alloys & Minor Metals"]
[34250,"Cadmium min 99.95% MB free market Cts per lb in warehouse","Alloys & Minor Metals"]
[34251,"Cadmium min. 99.99% MB free market Cts per lb in warehouse","Alloys & Minor Metals"]
[34252,"Germanium Dioxide MB free market, $ per kilo","Alloys & Minor Metals"]
[34253,"Indium Ingots MB free market $ per kg in warehouse","Alloys & Minor Metals"]
[34254,"Manganese min. 99.7% electrolytic manganese flake MB free market $ per tonne in warehouse","Alloys & Minor Metals"]
[34256,"Mercury MB free market $ per flask in warehouse ","Alloys & Minor Metals"]
[34257,"Selenium MB free market $ per lb in warehouse","Alloys & Minor Metals"]
[34258,"Cobalt High Grade MB free market $ per lb in warehouse","Alloys & Minor Metals"]
[34259,"Cobalt Low Grade MB free market $ per lb in warehouse","Alloys & Minor Metals"]
[34260,"Cadmium 99.95% min MB free market Cts per lb in warehouse Monthly average","Alloys & Minor Metals"]
[34261,"Cadmium 99.99% min MB free market Cts per lb in warehouse Monthly average","Alloys & Minor Metals"]
[34262,"Cobalt High Grade MB free market $ per lb in warehouse Monthly average","Alloys & Minor Metals"]
[34263,"Germanium Dioxide MB free market $ per kg Monthly average ","Alloys & Minor Metals"]
[34264,"Tungsten APT European free market $ per mtu Monthly average","Alloys & Minor Metals"]
[34266,"Ferro-vanadium basis 78% min, free delivered duty paid, consumer plant,1st grade Western Europe, monthly average $ per kg V","Alloys & Minor Metals"]
[34268,"Cobalt Low Grade MB free market $ per lb in warehouse Monthly average","Alloys & Minor Metals"]
[34271,"Arsenic MB free market $ per lb in warehouse","Alloys & Minor Metals"]
[34272,"Magnesium MB free market min $ per tonne","Alloys & Minor Metals"]
[34293,"Ferro-molybdenum 65/70% Mo US free market Pittsburgh $ per lb in warehouse","Alloys & Minor Metals"]
[34294,"Ferro-vanadium US free market 70-80% V in warehouse, Pittsburgh $ per lb.","Alloys & Minor Metals"]
[34351,"Ferro-silicon export from mainland China, Min 75% Si, 7.5% C, $/tonne, fob","Alloys & Minor Metals"]
[34357,"Silicon export from mainland China, 98.5% $/tonne, fob","Alloys & Minor Metals"]
[34358,"Tungsten APT export from mainland China, Chinese number 1 grade, min 88.5% WO 3, $/mtu, fob","Alloys & Minor Metals"]
[34445,"Ferro-titanium 70% (max 4.5% Al) MB free market $ per kg Ti d/d Europe","Alloys & Minor Metals"]
[34456,"Magnesium min 99.8% Mg, fob China main ports $ per tonne","Alloys & Minor Metals"]
[34464,"Silicon United States Free market Cents per lb Monthly Average","Alloys & Minor Metals"]
[34466,"Silicon MB free market Euros per tonne Monthly Average","Alloys & Minor Metals"]
[34473,"Manganese 99.7% electrolytic manganese flake MB free market Monthly Average $ per tonne in warehouse","Alloys & Minor Metals"]
[34572,"Lithium Ore Petalite 4.2% Li2O bagged fob Durban $ per tonne cif Europe","Alloys & Minor Metals"]
[34573,"Lithium Ore Spodumene >7.5% Li2O cif Europe $ per tonne cif Europe","Alloys & Minor Metals"]
[34576,"Titanium Ore Rutile conc. min 95% TiO2 Bagged US$ per tonne fob/Aus ","Alloys & Minor Metals"]
[34577,"Titanium Ore Rutile bulk conc. min 95% TiO2 $ per tonne fob/Aus","Alloys & Minor Metals"]
[34578,"Titanium Ore Ilmenite bulk conc. min 54% TiO2 $ per tonne fob/Aus ","Alloys & Minor Metals"]
[35116,"Ferro-chrome 0.06% C max - 65% Cr European low carbon in warehouse $ per lb Cr","Alloys & Minor Metals"]
[35117,"Ferro-chrome 0.05%C - 65% min Cr low carbon United States Free market duty paid fob Pittsburgh $ per lb Cr","Alloys & Minor Metals"]
[35118,"Ferro-chrome 0.10%C - 62% min Cr United States Free market low carbon duty paid fob Pittsburgh $ per lb Cr","Alloys & Minor Metals"]
[35119,"Ferro-chrome 0.15%C - 60% min Cr United States Free market low carbon duty paid fob Pittsburgh $ per lb Cr  ","Alloys & Minor Metals"]
[35123,"Ferro-manganese 80% min Mn 1.5 max C United States free market medium carbon duty paid fob Pittsburgh $ per lb","Alloys & Minor Metals"]
[35203,"Silicon MB free market Euros per tonne","Alloys & Minor Metals"]
[35268,"Ferro-molybdenum basis 65% min, in-warehouse Rotterdam, monthly average, $ per kg Mo","Alloys & Minor Metals"]
[35270,"Mercury MB free market $ per flask in warehouse Monthly Average   ","Alloys & Minor Metals"]
[35386,"Non-Ferrous Metals Magnesium Metal Chinese Free Market Averages 99.8% fob China main ports $ per tonne","Alloys & Minor Metals"]
[36155,"Antimony Metal MMTA Standard Grade II $/tonne in warehouse Rotterdam ","Alloys & Minor Metals"]
[36156,"Antimony metal MMTA Standard Grade II, $/tonne in warehouse Rotterdam, monthly average","Alloys & Minor Metals"]
[36157,"Ferro-Chrome China Spot 6-8% C, basis 50% Cr delivered duty paid China RMB/tonne ","Alloys & Minor Metals"]
[36177,"Ferro-Titanium 70% (max 4.5% Al) MB free market monthly average $/kg Ti d/d Europe","Alloys & Minor Metals"]
[36178,"Ferro-Tungsten basis 75% W min Monthly Average $/kg in warehouse Rotterdam","Alloys & Minor Metals"]
[36179,"Ferro-manganese MB Chinese free market min 65% Mn, max 7.0% C in warehouse China RMB/tonne","Alloys & Minor Metals"]
[36180,"Ferro-silicon MB Chinese free market min 75% in warehouse China RMB/tonne","Alloys & Minor Metals"]
[36181,"Tungsten concentrate MB Chinese free market, 65% W03, in warehouse China RMB/tonne","Alloys & Minor Metals"]
[36182,"Molybdenum concentrate MB Chinese free market, 45% Mo in warehouse China RMB/mtu","Alloys & Minor Metals"]
[36189,"Antimony Metal MB Chinese free market MMTA Standard Grade II delivered duty paid RMB/tonne","Alloys & Minor Metals"]
[36190,"Non-Ferrous Metals Magnesium Metal MB Chinese free market min 99% Mg, ex-works RMB/tonne","Alloys & Minor Metals"]
[36191,"Silico-manganese MB Chinese free market, min 65%   Mn max 17% Si, in warehouse China RMB/tonne","Alloys & Minor Metals"]
[36223,"Non-Ferrous Metals Rhenium in warehouse Rotterdam duty unpaid Metal Pellets min 99.9% $/Ib","Alloys & Minor Metals"]
[36224,"Non-Ferrous Metals Rhenium in warehouse Rotterdam duty unpaid APR Catalytic grade $/kg","Alloys & Minor Metals"]
[36227,"Ferro-Chrome China Contract 6-8% C, basis 50% Cr delivered duty paid China RMB/tonne","Alloys & Minor Metals"]
[36309,"Ferro-Chome Low phosphorous Cr min 65%, C max 7%, Si max 1%, P max 0.015%, Ti max 0.05% $ per lb","Alloys & Minor Metals"]
[36312,"Chrome Ore South Africa SA UG2 Met grade basis 42% $ per tonne cif main Chinese ports","Alloys & Minor Metals"]
[36336,"Non-Ferrous Metals Chrome Ore cfr main Chinese ports Turkish lumpy 40-42% $ per tonne","Alloys & Minor Metals"]
[42021,"Tellurium Metal MB free market min. 99.9% $/kg","Alloys & Minor Metals"]
[42022,"Gallium Metal MB free market $/kg   ","Alloys & Minor Metals"]
[42081,"Bismuth MB China domestic min 99.99% RMB/tonne","Alloys & Minor Metals"]
[42082,"Gallium MB China domestic, min 99.99% RMB/kg","Alloys & Minor Metals"]
[42083,"Indium MB China domestic min 99.99% RMB/kg","Alloys & Minor Metals"]
[42084,"Selenium MB China domestic min 99.9% RMB/kg","Alloys & Minor Metals"]
[42085,"Selenium dioxide MB China domestic min 98% RMB/kg","Alloys & Minor Metals"]
[42086,"Tellurium MB China domestic min 99.99% RMB/kg","Alloys & Minor Metals"]
[42087,"Germanium Metal Rotterdam $/kg","Alloys & Minor Metals"]
[42088,"Cobalt Metal MB China domestic min 99.8% RMB/tonne","Alloys & Minor Metals"]
[42089,"Germanium metal MB China domestic min 99.999% RMB/kg","Alloys & Minor Metals"]
[42151,"Germanium Metal Rotterdam $ per kg Monthly Average","Alloys & Minor Metals"]
[42260,"Ferro-chrome China import charge chrome 50% Cr index, CIF Shanghai, duty unpaid, $ per Ib contained chrome","Alloys & Minor Metals"]
[42280,"Gallium Metal MB free market $ per kg Monthly average  ","Alloys & Minor Metals"]
[42285,"Manganese Ore Index 44% Mn, Cif Tianjin $ per dmtu of metal contained","Alloys & Minor Metals"]
[42286,"Manganese Ore Index 37% Mn, Fob Port Elizabeth $ per dmtu of metal contained","Alloys & Minor Metals"]
[42460,"Cobalt High grade MB free market weighted average of all confirmed international trades $ per lb in warehouse","Alloys & Minor Metals"]
[42461,"Cobalt Low grade MB free market weighted average of all confirmed international trades $ per Ib in warehouse","Alloys & Minor Metals"]
[42557,"Silico-manganese 65% min Mn 16% min Si $ per tonne fob India","Alloys & Minor Metals"]
[43071,"Cobalt tetroxide min 72.6% Co delivered China RMB/tonne","Alloys & Minor Metals"]
[43117,"Ferro-Tungsten, China export min 75% $ per kg W, fob China","Alloys & Minor Metals"]
[43137,"Hafnium 1% Zr max, in warehouse global locations, $ per kg","Alloys & Minor Metals"]
[34011,"Aluminium P1020A, in-warehouse Rotterdam duty-paid, spot $/tonne","Base Metal"]
[34012,"Aluminium P1020A, in-warehouse Rotterdam duty-paid, for delivery three months forward, $/tonne","Base Metal"]
[34013,"Aluminium P1020A, cif main Japanese ports, quarterly, $/tonne","Base Metal"]
[34015,"Aluminium P1020A, delivered US midwest, spot, $/Ib","Base Metal"]
[34025,"Nickel Melting United States Free market premium indicator $ per lb in warehouse","Base Metal"]
[34043,"Tin Kuala Lumpur Tin Market (KLTM) $ per tonne","Base Metal"]
[34044,"Tin United States New York spot, Cents per lb","Base Metal"]
[34137,"Aluminium P1020A, in-warehouse Rotterdam duty-unpaid, spot low-high monthly average, $/tonne","Base Metal"]
[34147,"Nickel Melting United States Free market premium indicator $ per lb in warehouse Monthly average","Base Metal"]
[34158,"LM24 Non-Ferrous Metals Aluminium Scrap & Foundry Ingot United Kingdom £ per tonne Monthly Average","Base Metal"]
[34159,"Aluminium Scrap and Foundry Ingots LM6/LM25 Gravity diecasting ingot United Kingdom £ per tonne Monthly average","Base Metal"]
[34186,"Copper High grade cathode United States premium indicator $ per tonne  ","Base Metal"]
[34210,"Zinc Special High Grade United States MB free market assessment $ per lb","Base Metal"]
[34211,"Copper High Grade Comex Open Interest Daily Price Cents per lb. ","Base Metal"]
[34212,"Copper High Grade Comex Spot Settlement Daily Price Cents per lb. ","Base Metal"]
[34371,"Lead High grade ingot United States premium indicator $ per lb","Base Metal"]
[34407,"Aluminium P1020A, in-warehouse Rotterdam duty-unpaid, spot low-high, $/tonne","Base Metal"]
[34410,"Aluminium 6063 extrusion billet, in-warehouse Rotterdam duty-paid, spot $/tonne","Base Metal"]
[34501,"Aluminium P1020A, in-warehouse Rotterdam duty-paid, for delivery three months forward, monthly average $/tonne","Base Metal"]
[34507,"Aluminium P1020A, in-warehouse Singapore, spot low-high, $/tonne","Base Metal"]
[34509,"Aluminium Scrap and Foundry Ingots LM24 Pressure diecasting ingot United Kingdom £ per tonne","Base Metal"]
[34510,"Aluminium Scrap and Foundry Ingots LM6/LM25 Gravity diecasting ingot United Kingdom £ per tonne","Base Metal"]
[34511,"Aluminium Scrap and Foundry Ingots Aluminium pressure diecasting ingot DIN226/A380 European MB Free Market Duty paid delivered works euros per tonnes","Base Metal"]
[34512,"Singapore, copper low-high premium, Garde A, cathode, in warehouse, $ per tonne","Base Metal"]
[34521,"Singapore, Zinc low-high premium, 99.995% purity, in warehouse, $ per tonne","Base Metal"]
[34523,"Copper Shanghai Futures Exchange Yuan per tonne","Base Metal"]
[34526,"Shanghai, copper low-high premium, Grade A, cathode, in warehouse $ per tonne","Base Metal"]
[34551,"Aluminium Metal Shanghai Futures Exchange Rmb/tonne ","Base Metal"]
[34558,"Copper Republican copper price for Palabora 7.90mm South Africa Rand per tonne","Base Metal"]
[34587,"Aluminium Bronze AB1 United Kingdom £ per tonne, ex-works","Base Metal"]
[34653,"Aluminium Scrap and Foundry Ingot A-380.1 alloy United States d/d Midwest $ per lb","Base Metal"]
[34694,"Nymex, Comex Stocks Copper ","Base Metal"]
[35095,"Lead MB Battery grade free market premium in warehouse € per tonne","Base Metal"]
[35221,"Rotterdam, copper low-high premium, Grade A, cathode, in warehouse, $ per tonne","Base Metal"]
[35380,"Aluminium P1020A, cif main Japanese ports, quarterly, monthly average $/tonne","Base Metal"]
[35385,"Aluminium P1020A, in-warehouse Rotterdam duty-paid, spot monthly average $/tonne","Base Metal"]
[35466,"Aluminium Europe Duty paid d/d works pressure diecasing ingot price DIN 226/A380 euros/tonne Monthly Average","Base Metal"]
[36097,"Codelco Producer Premium $ per tonne","Base Metal"]
[36104,"Nickel Metal Europe uncut cathodes premium indicator in warehouse Rotterdam $/tonne  ","Base Metal"]
[36105,"Nickel Metal Europe 4x4 cathodes premium indicator in warehouse Rotterdam $/tonne    ","Base Metal"]
[36106,"Nickel Metal Europe briquettes premium indicator in warehouse Rotterdam $/tonne  ","Base Metal"]
[36158,"Shanghai Aluminium Weekly Stocks Deliverable per tonne ","Base Metal"]
[36159,"Shanghai Weekly Copper Stocks Deliverable per tonne ","Base Metal"]
[36172,"Zinc Metal MB EU Special High Grade, FCA Rotterdam $ per tonne","Base Metal"]
[36188,"Alumina MB Chinese free market Metallurgical grade, delivered duty paid RMB/tonne","Base Metal"]
[36244,"Non-Ferrous Metals Zinc Metal Shanghai Futures Exchange RMB/tonne ","Base Metal"]
[36245,"Non-Ferrous Metals Zinc Metal Shanghai Zinc weekly stocks Deliverable stocks per tonne ","Base Metal"]
[36258,"Non-Ferrous Metals Lead Metal Ca/Ca grid lead (average) euros per tonne ","Base Metal"]
[36326,"Shanghai, Zinc low-high premium, 99.995% purity, in warehouse, $ per tonne","Base Metal"]
[36333," European Free Market Tin premium spot 99.9% $ per tonne  ","Base Metal"]
[36334," European Free Market Tin premium spot 99.85% $ per tonne  ","Base Metal"]
[36960,"Connector lead (average) Non-Ferrous Metals Lead Metal Connector lead (average) euros per tonne ","Base Metal"]
[37651,"Soft lead (average) Non-Ferrous Metals Lead Metal Soft Lead (average) euros per tonne ","Base Metal"]
[42047,"Non-Ferrous Metals Alumina Index Fob Australia $ per tonne  ","Base Metal"]
[42091,"Rotterdam, copper premium, Grade A, cathode, in warehouse, $ per tonne","Base Metal"]
[42092,"Singapore, copper premium, Grade A cathode, in warehouse, $ per tonne","Base Metal"]
[42093,"Shanghai, copper premium, Grade A, cathode, in warehouse, $ per tonne","Base Metal"]
[42102,"Leghorn, copper low-high premium, Grade A, cathode, cif, $ per tonne","Base Metal"]
[42103,"Leghorn, copper premium, Grade A, cathode, cif, $ per tonne","Base Metal"]
[42106,"South Korea, copper low-high premium, Grade A, cathode, cif, $ per tonne (formerly Busan)","Base Metal"]
[42107,"South Korea, copper premium, Grade A, cathode, cif, $ per tonne (formerly Busan)","Base Metal"]
[42113,"Aluminium P1020A, in-warehouse Rotterdam duty-unpaid, spot, $/tonne","Base Metal"]
[42114,"Aluminium P1020A, in-warehouse Singapore, spot, $/tonne","Base Metal"]
[42115,"Aluminium P1020A, cif, Korea (Gwangyang or Busan), spot low-high, $/tonne","Base Metal"]
[42116,"Aluminium P1020A, cif Korea (Gwangyang or Busan), spot, $/tonne","Base Metal"]
[42117,"Aluminium P1020A, in-warehouse Johor, spot low-high, $/tonne","Base Metal"]
[42118,"Aluminium P1020A, in-warehouse Johor, spot, $/tonne","Base Metal"]
[42125,"Rotterdam, Lead low-high premium, 99.97% purity, in warehouse, $ per tonne","Base Metal"]
[42126,"Rotterdam, lead premium, 99.97% purity, in warehouse, $ per tonne","Base Metal"]
[42135,"Rotterdam, Zinc low-high premium, 99.995% purity, in warehouse, $ per tonne","Base Metal"]
[42136,"Rotterdam, zinc premium, 99.995% purity in warehouse, $ per tonne","Base Metal"]
[42137,"Singapore, zinc premium, 99.995% purity, in warehouse, $ per tonne","Base Metal"]
[42138,"South Korea, Zinc low-high premium, 99.995% purity, in warehouse, $ per tonne (renamed formerly Gwangyang)","Base Metal"]
[42139,"South Korea, zinc premium, 99.995% purity, in warehouse, $ per tonne (renamed formerly Gwangyang)","Base Metal"]
[42140,"Johor, Zinc low-high premium, 99.995% purity, in warehouse, $ per tonne","Base Metal"]
[42141,"Johor, zinc premium, 99.995% purity, in warehouse, $ per tonne","Base Metal"]
[42146,"Shanghai, zinc premium, 99.995% purity, in warehouse, $ per tonne","Base Metal"]
[42147,"Shanghai, Nickel low-high premium, 99.80% purity, in warehouse, $ per tonne","Base Metal"]
[42148,"Shanghai, nickel premium, 99.80% purity, in warehouse, $ per tonne","Base Metal"]
[42149,"Aluminium P1020A, cif Shanghai, spot low-high, $/tonne","Base Metal"]
[42150,"Aluminium P1020A, cif Shanghai, spot, $/tonne","Base Metal"]
[42193,"Aluminium P1020A, in-warehouse Rotterdam duty un-paid spot, monthly average, $/tonne","Base Metal"]
[42194,"Aluminium P1020A, in-warehouse Singapore, spot low-high monthly average, $/tonne","Base Metal"]
[42195,"Aluminium P1020A, in-warehouse Singapore, spot, monthly average, $/tonne","Base Metal"]
[42200,"Aluminium P1020A, cif, Korea (Gwangyang or Busan), spot low-high monthly average, $/tonne","Base Metal"]
[42201,"Aluminium P1020A, in-warehouse Johor, spot, monthly average, $/tonne","Base Metal"]
[42202,"Aluminium P1020A, cif, Korea (Gwangyang or Busan), spot, monthly average, $/tonne","Base Metal"]
[42203,"Aluminium P1020A, in-warehouse Johor, spot low-high monthly average, $/tonne","Base Metal"]
[42206,"Aluminium P1020A, cif Shanghai, spot low-high monthly average, $/tonne","Base Metal"]
[42207,"Aluminium P1020A, cif Shanghai, spot, monthly average, $/tonne","Base Metal"]
[42208,"MB copper premium Rotterdam Grade A copper cathode to meet LME spec BSEN 1978:1998 (Cu-CATH-1) low - high monthly average $ per tonne","Base Metal"]
[42209,"MB copper premium Rotterdam Grade A copper cathode to meet LME spec BSEN 1978:1998 (Cu-CATH-1)  monthly average $ per tonne","Base Metal"]
[42214,"MB Copper Premium Busan Grade A copper cathode to meet LME spec BSEN 1978:1998 (Cu-CATH-1) low - high monthly average $ per tonne","Base Metal"]
[42215,"MB Copper Premium Busan Grade A copper cathode to meet LME spec BSEN 1978:1998 (Cu-CATH-1) monthly average $ per tonne","Base Metal"]
[42222,"MB copper premium Leghorn Grade A copper cathode to meet LME spec BSEN 1978:1998 (Cu-CATH-1) low - high monthly average $ per tonne","Base Metal"]
[42223,"MB copper premium Leghorn Grade A copper cathode to meet LME spec BSEN 1978:1998 (Cu-CATH-1) monthly average $ per tonne","Base Metal"]
[42224,"MB copper premium Shanghai Grade A copper cathode to meet LME spec BSEN 1978:1998 (Cu-CATH-1) low - high monthly average $ per tonne","Base Metal"]
[42225,"MB copper premium Shanghai Grade A copper cathode to meet LME spec BSEN 1978:1998 (Cu-CATH-1) monthly average $ per tonne","Base Metal"]
[42226,"MB copper premium Singapore Grade A copper cathode to meet LME spec BSEN 1978:1998 (Cu-CATH-1) low - high monthly average $ per tonne","Base Metal"]
[42227,"MB copper premium Singapore Grade A copper cathode to meet LME spec BSEN 1978:1998 (Cu-CATH-1) monthly average $ per tonne","Base Metal"]
[42234,"MB Lead premium Rotterdam primary lead of 99.97% purity to meet LME spec: BS EN 12659:1999 low - high monthly average $ per tonne","Base Metal"]
[42235,"MB Lead premium Rotterdam primary lead of 99.97% purity to meet LME spec: BS EN 12659:1999 calculated premium monthly average $ per tonne","Base Metal"]
[42238,"MB nickel premium Shanghai primary nickel of 99.80% to meet LME spec: B39:79 (2008) low - high monthly average $ per tonne","Base Metal"]
[42239,"MB nickel premium Shanghai primary nickel of 99.80% to meet LME spec: B39:79 (2008) calculated premium monthly average $ per tonne","Base Metal"]
[42243,"MB Zinc premium Shanghai primary zinc to meet LME spec: BS EN 1179:2003 low-high monthly average $ per tonne","Base Metal"]
[42244,"MB Zinc premium Shanghai primary zinc to meet LME spec: BS EN 1179:2003 calculated premium monthly average $ per tonne","Base Metal"]
[42247,"MB Zinc Premium Gwangyang primary zinc to meet LME spec: BS EN 1179:2003 low-high monthly average $ per tonne","Base Metal"]
[42248,"MB Zinc premium Gwangyang primary zinc to meet LME spec: BS EN 1179:2003 calculated premium monthly average $ per tonne","Base Metal"]
[42249,"MB Zinc premium Johor primary zinc to meet LME spec: BS EN 1179:2003 low-high monthly average $ per tonne","Base Metal"]
[42250,"MB Zinc premium Johor to meet LME spec: BS EN 1179:2003 calculated premium monthly average $ per tonne","Base Metal"]
[42253,"MB Zinc premium Rotterdam to meet LME spec: BS EN 1179:2003 low-high monthly average $ per tonne","Base Metal"]
[42254,"MB Zinc premium Rotterdam to meet LME spec: BS EN 1179:2003 calculated premium monthly average $ per tonne","Base Metal"]
[42255,"MB Zinc premium Singapore to meet LME spec: BS EN 1179:2003 low-high monthly average $ per tonne","Base Metal"]
[42256,"MB Zinc premium Singapore to meet LME spec: BS EN 1179:2003 calculated premium monthly average $ per tonne","Base Metal"]
[42281,"Aluminium P1020A, cif main Japanese ports, spot low-high, $/tonne","Base Metal"]
[42282,"Aluminium P1020A, cif main Japanese ports, spot, $/tonne","Base Metal"]
[42390,"European Industrial battery premium in warehouse Rotterdam free market (Eurobat) Stand-by refined or soft lead (average) € per tonne","Base Metal"]
[42391,"European Industrial battery premium in warehouse Rotterdam free market (Eurobat) Traction refined or soft lead (average) € per tonne","Base Metal"]
[42397,"Non-Ferrous Metals Alumina Index Fob Australia $ per tonne Monthly Average","Base Metal"]
[42409,"Zinc UK Special High Grade delivered customer works basis monthly average £ per tonne ","Base Metal"]
[42410,"Johor, copper low-high premium, Grade A, cathode in warehouse, $ per tonne","Base Metal"]
[42411,"Johor, copper premium, Grade A, cathode, in warehouse $ per tonne","Base Metal"]
[42459,"Copper Aurubis European Grade A cathode premium ex-works $ per tonne","Base Metal"]
[42474,"Nickel pig iron high grade NPI content 10-15% spot price China RMB per nickel unit price","Base Metal"]
[42475,"Nickel pig iron high grade NPI content 10-15% contract price delivered duty paid China RMB per nickel unit price","Base Metal"]
[42476,"Aluminium P1020A, delivered Sao Paulo region, spot, $/tonne","Base Metal"]
[42477,"Copper Concentrate Asia-Pacific Index TC import $ per dmt published twice monthly on 15th and last day of month","Base Metal"]
[42478,"Copper Concentrate Asia-Pacific Index RC import US cents per Ib published twice monthly on 15th and last day of month","Base Metal"]
[42479,"Nickel ore 1.8% basis cif China 15-20% Fe Water content: 30-35% Si:Mg ratio<2 Lot size 50,000 tonnes $ per tonne","Base Metal"]
[42530,"Nickel rand fixing price per tonne for LME trade","Base Metal"]
[42533,"Aluminium rand fixing price per tonne for LME trade","Base Metal"]
[42534,"Copper rand fixing price per tonne for LME trade","Base Metal"]
[42535,"Lead rand fixing price per tonne for LME trade","Base Metal"]
[42536,"Zinc rand fixing price per tonne for LME trade","Base Metal"]
[42537,"Tin rand fixing price per tonne for LME trade","Base Metal"]
[42550,"Aluminium P1020A, cif Brazilian main ports duty-unpaid, spot, $/tonne","Base Metal"]
[42560,"Shanghai, copper low-high premium, Grade A, cathode, cif, $ per tonne","Base Metal"]
[42561,"Shanghai, copper premium, Grade A, cathode, cif, $ per tonne","Base Metal"]
[43085,"Aluminium 6063 & 6060 extrusion billet, cif Brazilian main ports, spot (premium over LME cash), $/tonne","Base Metal"]
[43086,"Johor, lead premium, 99.97% purity, in warehouse, $ per tonne","Base Metal"]
[43087,"Johor, lead low-high premium, 99.97% purity, in warehouse, $ per tonne","Base Metal"]
[43092,"Nickel 99.80% briquettes premium in-warehouse Malaysia $/tonne","Base Metal"]
[43093,"Nickel 99.80% briquettes premium in-warehouse Singapore $/tonne","Base Metal"]
[43094,"Nickel 99.80% Full Plate premium in-warehouse Malaysia $/tonne","Base Metal"]
[43095,"Nickel 99.80% Full Plate premium in-warehouse Singapore $/tonne","Base Metal"]
[43098,"Nickel import arbitrage $ per tonne","Base Metal"]
[43099,"Nickel import arbitrage yuan per tonne","Base Metal"]
[43114,"Alumina Index, fob Brazil, adjustment to fob Australia index $ per dry metric tonne","Base Metal"]
[43116,"Aluminium extrusion billet premium 6063 Cif Japan $ per tonne","Base Metal"]
[43118,"Aluminium import arbitrage $ per tonne","Base Metal"]
[43119,"Aluminium import arbitrage yuan per tonne","Base Metal"]
[43120,"Copper import arbitrage $ per tonne","Base Metal"]
[43121,"Copper import arbitrage yuan per tonne","Base Metal"]
[43122,"Zinc import arbitrage $ per tonne","Base Metal"]
[43123,"Zinc import arbitrage yuan per tonne","Base Metal"]

{"sheet":"Reuters","index":9,"n_rows":904,"n_cols":6,"rows_kept":904,"cut":false,"hidden":true,"merged":[]}
[]
["SymbolId","MarketId","Price ID","RIC","Instrument Short Name","Instrument Long Name"]
["MB-AL-0004",5,34011,34047,"Al P1020A,in-whs Rdm duty-paid  ","Aluminium P1020A, in-warehouse Rotterdam duty-paid, spot $/tonne                "]
["MB-AL-0003",4,34012,"AL-HIGLMPMW-MB","Al HG 3Mnt 99.7 Ing EU LME P whs","Aluminium P1020A, in-warehouse Rotterdam duty-paid, for delivery 3M forward     "]
["MB-AL-0001",2,34013,"AL-SPJPDUP-MB","Al P1020A,cif main Japan prt,qt\"","Aluminium P1020A, cif main Japanese ports, quarterly, $/tonne                   "]
["MB-AL-0232",1544,34015,"AL-USFMKPM-MB","\"Al P1020A,deliv US midwest,spot","Aluminium P1020A, delivered US midwest, spot, $/Ib                              "]
["MB-In-0004",1628,34018,"IN-INGMA-MB","Indium Ings 99.7%/$ kilo        ","Indium Ingots 99.7% $/kilo fob                                                  "]
["MB-IR-0001",1489,34019,"IR-ENGBSW-MB","Iridium Ing min 99.9% Europe whs","Iridium ingot min 99.9% Europe $ per troy oz in warehouse                       "]
["MB-MO-0001",145,34021,"MO-CAOXUSW-MB","Mo Canned molybdic oxide US whs ","Molybdenum Canned molybdic oxide United States $ per lb Mo in warehouse         "]
["MB-FEO-0003",144,34022,"MO-DROXIW-MB","Mo Drummed molybdic oxide whs   ","Molybdenum Drummed molybdic oxide $ per lb Mo in warehouse                      "]
["MB-NI-0091",1547,34025,"NI-MLTUSPW-MB","Nickel Melting US Prm indc whs  ","Nickel Melting United States premium indicator $ per lb in warehouse            "]
["MB-NI-0092",1548,34026,"NI-PLTUSPW-MB","The record could not be found","The record could not be found"]
["MB-PD-0005",1487,34027,"XPD-EUMNW-MB","Pld min 99.9% Europe whs        ","Palladium min 99.9% Europe $ per troy oz in warehouse                           "]
["MB-PD-0004",1481,34028,"XPD-JOMBSP-MB","Pld Johnson Mat base prc (unfab)","Palladium Johnson Matthey base price (unfab) $/troy oz (0900 hrs)               "]
["MB-PT-0005",1486,34029,"XPT-EUMNW-MB","Platinum min 99.9% EU in whs    ","Platinum min 99.9% European $ per troy oz in warehouse                          "]
["MB-PT-0004",1485,34030,"XPT-JOMBSP-MB","Platinum JohnsonMat. base price ","Platinum Johnson Matthey base price (unfab) $/troy oz (0900 hrs)                "]
["MB-RH-0001",1488,34031,"RH-EURIW-MB","Rhodium min 99.9% EU in whs     ","Rhodium min 99.9% European $ troy oz in warehouse                               "]
["MB-RH-0003",1632,34032,"RH-JOMBSP-MB","Rhd. JohnsonMat base price      ","Rhodium Johnson Matthey base price (unfab) $/troy oz (0900 hrs)                 "]
["MB-RU-0001",1490,34033,"RU-EURIW-MB","Ruthenium min 99.9% EU in whs   ","Ruthenium min 99.9% European $ per troy oz in warehouse                         "]
["MB-CU-0357",1782,34040,"CU-LMCSDOFL-MB","Cu Cash LME Daily Official      ","Copper Cash LME Daily Official GBP/tonne                                        "]
["MB-CU-0358",1783,34041,"CU-LM3DOFL-MB","Cu 3 Mnt LME Daily Official     ","Copper 3 months LME Daily Official GBP/METRIC TONNE                             "]
["MB-SN-0004",1629,34043,"SN-KLTMEML-MB","Tin Kuala Lumpur Tin Mrkt (KLTM)","Tin Kuala Lumpur Tin Market (KLTM) (exsmelter)                                  "]
["MB-SN-0006",1649,34044,"SN-USNYSPT-MB","Tin US New York spot            ","Tin US New York spot                                                            "]
["MB-PB-0069",1784,34045,"PB-LMCSDOG-MB","Lead Cash LME Dly Ofc GBP/tonne ","Lead Cash LME Daily Official GBP/tonne                                          "]
["MB-PB-0070",1785,34046,"PB-LM3MDOG-MB","Lead 3 Mnts LME Dly Ofc GBP/T   ","Lead 3 months LME Daily Official GBP/tonne                                      "]
["MB-AG-0001",1445,34047,"XAG-LBSPDOP-MB","XAG Spot Lon Brk Ofc Dly Prc Pen","Silver LBMA daily price pence per troy oz                                       "]
["MB-AG-0004",1448,34048,"XAG-HHUSD-MB","XAG Handy&Harman US Slr Dly Prc ","Silver Handy & Harman US Sellers Daily Price Cents/troy oz                      "]
["MB-AL-0270",1693,34049,"AL-LMCSDO-MB","Al Cash LME Dly Ofc             ","Aluminium Cash LME Daily Official $/tonne                                       "]
["MB-AL-0270",1693,34050,"AL-LM3MDO-MB","Al 3 Mnts LME Dly Ofc           ","Aluminium 3 months LME Daily Official $/tonne                                   "]
["MB-AL-0273",1704,34051,"AL-LMCSDU-MB","Al Cash LME Dly Unofc.          ","Aluminium Cash LME Daily Unofficial $/tonne                                     "]
["MB-AL-0273",1704,34052,"AL-LM3MDU-MB","Al 3 Mnts LME Dly Unofc.        ","Aluminium 3 months LME Daily Unofficial $/tonne                                 "]
["MB-NI-0096",1694,34054,"NI-LMCSDO-MB","Nickel Cash LME Dly Ofc         ","Nickel Cash LME Daily Official $/tonne                                          "]
["MB-NI-0096",1694,34055,"NI-LM3MDO-MB","Nickel 3 Mnts LME Dly Ofc       ","Nickel 3 months LME Daily Official $/tonne                                      "]
["MB-NI-0097",1705,34056,"NI-LMCSDU-MB","Nickel Cash LME Dly Unofc.      ","Nickel Cash LME Daily Unofficial $/tonne                                        "]
["MB-NI-0097",1705,34057,"NI-LM3MDU-MB","Nickel 3 Mnts LME Dly Unofc.    ","Nickel 3 months LME Daily Unofficial $/tonne                                    "]
["MB-AU-0001",1437,34059,"XAU-LOAMD-MB","Gold London Morning Dly Prc     ","Gold London Morning Daily Price $/troy oz                                       "]
["MB-AU-0002",1438,34060,"XAU-LOPMD-MB","Gold London Afternoon Dly Prc   ","Gold London Afternoon Daily Price $/troy oz                                     "]
["MB-PD-0001",1478,34061,"XPD-LOFDPCA-MB","Pld Lon FrMrkt daily prc chng AM","Palladium LBMA Morning $ per troy oz                                            "]
["MB-PD-0002",1479,34062,"XPD-LOFDPCP-MB","Pld Lon FrMrkt daily prc chng PM","Palladium LBMA Afternoon $ per troy oz                                          "]
["MB-PT-0001",1482,34063,"XPT-LODFMAM-MB","Platinum London FrMrkt Morning  ","Platinum LBMA Morning $ per troy oz.                                            "]
["MB-PT-0002",1483,34064,"XPT-LODFMPM-MB","Platinum London FrMrkt Afternoon","Platinum LBMA Afternoon $ per troy oz                                           "]
["MB-FEC-0016",1842,34065,"FCR-LUCRBEUD-MB","FCR Lmpy CR chrg bsis 52% EU dst","Ferro-Cr Lumpy CR charge basis 52% Cr qrterly major EU destinations US cents/lb "]
["MB-FEC-0004",102,34066,"FCR-CBEUDST-MB","FCR 6-8% C 60% Cr mx15%Si EU dst","Ferro-chrome 6-8% C basis 60% Cr max 1.5% Si major EU destinations $/lb Cr      "]
["MB-FEC-0003",101,34067,"FCR-EUDSTAV-MB","FCR 010% C avg 68-70% Cr EU dst ","Ferro-chrome 0.10% C average 68-70% Cr major European destinations $/lb Cr      "]
["MB-FEW-0001",109,34068,"FMN-CMEUDST-MB","FMN bs 78% Mn Std 7.5% C EU dst ","Ferro-Mn basis 78% Mn - Standard 7.5% C major EU destinations Euro per tonne    "]
["MB-FEH-0002",118,34069,"FSI-LUBEUDST-MB","FSI Lumpy basis 75% Si EU dst   ","Ferro-silicon Lumpy basis 75% Si major European destinations Euro per tonne     "]
["MB-SIM-0002",165,34070,"SMN-LUBEUDST-MB","SiMn lumpy 65-75%Mn 15-19%Si EU ","Silico-Mn lumpy 65-75% Mn basis 15-19% Si major EU destinations Euro/tonne      "]
["MB-FEO-0001",114,34071,"FMO-MJEUDST-MB","FMO Basis 65% Mo major EU dst   ","Ferro-molybdenum Basis 65% Mo major European destinations $ per kg Mo           "]
["MB-FEU-0001",121,34072,"FW-DURIWR-MB","FW basis 75% W RDM DtyUpd whs   ","Ferro-W basis 75% W Rotterdam duty unpaid $ per kg W in warehouse               "]
["MB-FEV-0001",122,34073,"FV-EUDST-MB","FV basis 78% V major EU dst     ","Ferro-vanadium basis 78% V major European destinations $ per kg V               "]
["","",34075,"AL-LMH3MO-MB","Al High Grade 3 Mnt LME Ofc MAvg","Aluminium High Grade 3 months LME Official $/tonne Monthly Average              "]
["","",34076,"AL-LMSTLDO-MB","Al Settlement LME Dly Ofc MAvg  ","Aluminium Settlement LME Daily Official $/tonne Monthly Average                 "]
["","",34077,"SN-LMCSDO-MB","Tin Cash LME Dly Ofc MAvg       ","Tin Cash LME Daily Official $/tonne Monthly Average                             "]
["","",34078,"SN-LM3MDO-MB","Tin 3 Mnts LME Dly Ofc MAvg     ","Tin 3 months LME Daily Official $/tonne Monthly Average                         "]
["","",34079,"SN-LMSTLDO-MB","Tin Stl. LME Dly Ofc MAvg       ","Tin Settlement LME Daily Official $/tonne Monthly Average                       "]
["","",34082,"NI-LMSTLDO-MB","Nickel Stl. LME Dly Ofc Mavg    ","Nickel Settlement LME Daily Official $/tonne Monthly Average                    "]
["MB-V-0001",197,34088,"V-OREUR-MB","V Ore (pentoxide)Min 98% EU     ","Vanadium Ore (pentoxide)Min 98% Europe $ per lb V2O5                            "]
["MB-ZIR-0002",1757,34089,"ZR-ORFGBEUF-MB","Zr Ore Foundry grd bulk EU fob  ","Zirconium Ore Foundry grade bulk Europe $/tonne fob                             "]
["MB-ZIR-0001",1756,34090,"ZR-ORPBEUF-MB","Zr Ore Prm bulk EU fob          ","Zirconium Ore Premium bulk Europe $/tonne fob                                   "]
["MB-CU-0313",1575,34092,"GN-INGLG2-MB","GunMtl Ing LG2 85/5/5/5 UK exwrk","Gunmetal Ingot LG2 85/5/5/5 UK GBP/tonne ex-works                               "]
["MB-TI-0001",177,34111,"TI-SCTUUPC-MB","Ti Scp Turng Unprc 0.5%Sn mx Cif","Titanium Scrap Turnings Unprocessed (90/6/4) (0.5% Sn Max) $/lb Cif             "]
["","",34115,"CU-SMSTTCR-MB","The record could not be found","The record could not be found"]
["MB-STE-0128",239,34122,"ST-LAMEBLT-MB","Lat AM export billet fob mn port","Latin America export billet $ per tonne fob main port                           "]
["MB-STE-0135",246,34123,"ST-LAMESLB-MB","Lat AM export slab fob main port","Latin America export slab $ per tonne fob main port                             "]
["MB-STS-0013",194,34127,"ST-SCSUKDD-MB","Steel Scp stnl 12-13% UK mrc d/d","Steel Scrap stainless 12-13% UK merchants d/d customer/docks GBP/tonne          "]
["MB-STS-0014",195,34128,"ST-SCSCSUKDD-MB","Steel Scp stnl 16-17%Cr solid UK","Steel Scrap stainless 16-17% Cr solids UK merchants customer/docks GBP/tonne    "]
["","",34129,"ST-SCSSTEUDD-MB","The record could not be found","The record could not be found"]
["","",34137,"AL-IGPMDUWMA-MB","Al Min99.7% Ing Upd prem whs MAv","Aluminium P1020A, in-warehouse Rotterdam duty-unpaid, spt low-high monthly avg  "]
["","",34138,"SB-MBIWMA-MB","Sb MB in whs  MAv               ","Antimony MB in warehouse $ per tonne Monthly average                            "]
["","",34139,"BI-MBTNIWMA-MB","Bi MB in whs $ per lb MAv       ","Bismuth MB tonne lots in warehouse $ per lb Monthly average                     "]
["","",34140,"XAU-LOAMDMA-MB","Gold London Morning Dly Prc MAv ","Gold London Morning Daily Price $/troy oz Monthly Avg                           "]
["","",34141,"XAU-LOPMDDMA-MB","Gold London Afternoon DlyPrc MAv","Gold London Afternoon Daily Price $/troy oz Monthly Avg                         "]
["","",34142,"XAU-HHUSDMA-MB","Gold Handy&Harman US Dly Prc MAv","Gold Handy & Harman US Daily Price $/troy oz Monthly Avg                        "]
["","",34143,"MO-DROXIWMA-MB","Mo Drummed molybdic oxide whs MA","Molybdenum Drummed molybdic oxide $ per lb Mo in warehouse Monthly average      "]
["","",34144,"MO-CAOXUSWMA-MB","Mo canned Mo oxide US whs MAv   ","Molybdenum canned molybdic oxide US $ per lb Mo in warehouse Monthly avg        "]
["","",34147,"NI-MLTUSPWMA-MB","Nickel Mlting US Prm indc whs MA","Nickel Melting US premium indicator $ per lb in warehouse Monthly average       "]
["","",34148,"NI-PLTUSPWMA-MB","The record could not be found","The record could not be found"]
["","",34149,"XPD-LODPCAMA-MB","Pld Lon daily price chang AM MAv","Palladium LBMA Morning $ per troy oz Monthly average                            "]
["","",34150,"XPD-LODPCPMA-MB","Pld Lon daily price chang PM MAv","Palladium LBMA Afternoon $ per troy oz Monthly average                          "]
["","",34151,"XPT-LODAMMA-MB","Platinum London Morning MAv     ","Platinum LBMA Morning $ per troy oz Monthly average                             "]
["","",34152,"XPT-LODPMMA-MB","Platinum London Afternoon MAv   ","Platinum LBMA Afternoon $ per troy oz Monthly average                           "]
["","",34153,"SE-MBIWMA-MB","Selenium MB $ per lb in whs MAv ","Selenium MB $ per lb in warehouse Monthly average                               "]
["","",34154,"XAG-LBDLPMA-MB","Silver LBMA daily price mnt avg ","Silver LBMA daily price pence per troy oz monthly average                       "]
["","",34158,"AL-SCFINUKMA-MB","LM24 NF AL ScpFn Ing UK  MAv    ","LM24 Non-Ferrous Aluminium Scrap & Foundry Ingot UK ú per tonne Monthly Average "]
["","",34159,"AL-ASFIGDMA-MB","Al SrpFn Ing LM6/LM25 Gr UK MAv ","Aluminium Scrap&Foundry Ingots LM6/LM25 Grav diecasting UK GBP/tonne Mthly avg  "]
["","",34160,"W-OREUMCMA-MB","The record could not be found","The record could not be found"]
["","",34161,"V-OREURMA-MB","V Ore min 98% V2O5 Europe MAv   ","Vanadium Ore min 98% V2O5 Europe Monthly average                                "]
["","",34162,"XAG-HHUSDMA-MB","XAG Handy&Harman US Slr Dly MA  ","Silver Handy & Harman US Sellers daily price Cents/troy oz Monthly Avg          "]
["MB-AG-0002",1446,34167,"XAG-LBSPDOC-MB","XAG Spot Lon. Brk Ofc Dly Prc   ","Silver LBMA daily price cents per troy oz                                       "]
["MB-ZN-0080",1695,34168,"ZN-LMCSDO-MB","Zinc Cash LME Dly Ofc           ","Zinc Cash LME Daily Official $/tonne                                            "]
["MB-ZN-0080",1695,34169,"ZN-LM3MDO-MB","Zinc 3 Mnts LME Dly Ofc         ","Zinc 3 months LME Daily Official $/tonne                                        "]
["MB-ZN-0081",1706,34170,"ZN-LMCSDU-MB","Zinc Cash LME Dly Unofc.        ","Zinc Cash LME Daily Unofficial $/tonne                                          "]
["MB-ZN-0081",1706,34171,"ZN-LM3MDU-MB","Zinc 3 Mnts LME Dly Unofc.      ","Zinc 3 months LME Daily Unofficial $/tonne                                      "]
["","",34175,"ZN-LMSTLDO-MB","Zinc Stl. LME Dly Ofc MAvg      ","Zinc Settlement LME Daily Official $/tonne Monthly Average                      "]
["MB-STE-0129",240,34177,"ST-LAMEREFR-MB","Lat AM export rebar fob main por","Latin America export rebar $ per tonne fob main port                            "]
["MB-STE-0130",241,34179,"ST-LAMEWRD-MB","Lat AM export wire rod fob mn po","Latin America export wire rod (mesh quality) $ per tonne fob main port          "]
["MB-STE-0134",245,34180,"ST-LAMEHPLT-MB","Lat AM export HvPlate fob mn prt","Latin America export heavy plate (thicker than 10mm) $ per tonne fob main port  "]
["MB-STE-0133",244,34181,"ST-LAMEHRCD-MB","Lat AM export HRC fob main port ","Latin America export hot rolled coil (dry) $ per tonne fob main port            "]
["MB-STE-0132",243,34182,"ST-LAMECRC-MB","Lat AM export CRC fob main port ","Latin America export cold rolled coil $ per tonne fob main port                 "]
["MB-STE-0131",242,34183,"ST-LAMEGALC-MB","Lat AM export HtDpGalvC fob main","Latin America export hot-dip galvanized coil $ per tonne fob main port          "]
["MB-CU-0310",1545,34186,"CU-HGCTUSPM-MB","Cu High grd cathode US Prm ind  ","Copper High grade cathode United States premium indicator $ per tonne           "]
["MB-SI-0003",440,34188,"SI-UNTST-MB","Silicon United States           ","Silicon United States Cents per lb                                              "]
["","",34190,"SN-MBUSPM-MB","The record could not be found","The record could not be found"]
["","",34191,"XAU-LOAMDGMA-MB","Gold London Morning Dly Prc MAv ","Gold London Morning Daily Price GBP/troy oz Monthly Avg                         "]
["","",34192,"XAU-LOPMDGMA-MB","Gold London Afternoon Dly Pr MAv","Gold London Afternoon Daily Price GBP/troy oz Monthly Avg                       "]
["","",34193,"XAG-LBDLCMA-MB","Silver LBMA daily price MntAvg  ","Silver LBMA daily price cents per troy oz monthly average                       "]
["MB-SN-0010",1708,34201,"SN-LMCSDU-MB","Tin Cash LME Dly Unofc.         ","Tin Cash LME Daily Unofficial $/tonne                                           "]
["MB-SN-0010",1708,34202,"SN-LM3MDU-MB","Tin 3 Mnts LME Dly Unofc.       ","Tin 3 months LME Daily Unofficial $/tonne                                       "]
["MB-PD-0010",1732,34203,"XPD-NYSTLD-MB","Pld Nymex Dly Stl. Prc $/troy oz","Palladium Nymex Daily Settlement Price $/troy oz                                "]
["MB-PT-0010",1730,34204,"XPT-NYSTLD-MB","PLT Nymex Dly Stl. $/troy oz    ","Platinum Nymex Daily Settlement $/troy oz                                       "]
["","",34205,"AL-LM3MSDO-MB","Al 3 Mnt seller LME Dly Ofc MAvg","Aluminium 3 months seller LME Daily Official $/tonne Monthly Average            "]
["","",34206,"NI-LM3MSDO-MB","Ni 3 Mnt seller LME Dly Ofc MAvg","Nickel 3 months seller LME Daily Official $/tonne Monthly Average               "]
["","",34208,"CU-ASMPBZCR-MB","Cu Aly Semi PBrnz CR PB102 5% UK","Copper Alloy Semis Phosphor Bronze Cold Rolled PB102 5% UK GBP/tonne            "]
["MB-CR-0001",41,34209,"CR-MBALTHW-MB","CR Wld MB alumino-trmc mn99% whs","Chromium World MB alumino-thermic min 99% $/tonne in warehouse                  "]
["MB-ZN-0068",1549,34210,"ZN-SPHGUSMBA-MB","Zn Special High grd US MB asmt  ","Zinc Special High Grade United States MB assessment $ per lb                    "]
["MB-CU-0343",1654,34211,"CU-CMHGOID-MB","Cu HgGrd CMX OI Dly Price       ","Copper High Grade Comex Open Interest Daily Price Cents/lb                      "]
["MB-CU-0353",1718,34212,"CU-CMHGSSTD-MB","Cu HgGrd CMX Spot Stl. Dly Prc  ","Copper High Grade Comex Spot Settlement Daily Price Cents/lb                    "]
["MB-STE-0171",307,34213,"ST-USIREB-MB","USA import rebar cfr Gulf       ","USA import rebar $ per short ton cfr Gulf                                       "]
["MB-STE-0203",432,34214,"ST-USIMBAR-MB","USA import Merchant Bar cfr Gulf","USA import merchant bar $ per short ton cfr Gulf                                "]
["MB-STE-0210",439,34215,"ST-USIMSEC-MB","US import med sections cfr Gulf ","USA import medium sections $ per short ton cfr Gulf                             "]
["","",34216,"ST-USIHSEC-MB","The record could not be found","The record could not be found"]
["MB-STE-0180",323,34217,"ST-USIHRC-MB","USA Import HRC cfr Gulf         ","USA import hot rolled coil (commodity grade) $ per short ton cfr Gulf           "]
["","",34218,"ST-USIHPLT-MB","The record could not be found","The record could not be found"]
["MB-STE-0179",322,34219,"ST-USIMPLT-MB","USA import MdPlate cfr Gulf     ","USA import medium plate $ per short ton cfr Gulf                                "]
["MB-STE-0181",324,34220,"ST-USICRC-MB","USA Import CRC cfr Gulf         ","USA import cold rolled coil $ per short ton cfr Gulf                            "]
["","",34222,"IN-INGMBWMA-MB","Indium Ing MB MAv in whs        ","Indium Ingots MB Monthly Average in warehouse $ per kilo                        "]
["MB-FEC-0012",1537,34236,"FCR-CBUSWPT-MB","FCR 6-8% C 60-65% Cr max2%Si US ","Ferro-Cr 6-8% C basis 60-65% Cr max 2% Si US in warehouse Pittsburgh $ per lb Cr"]
["MB-FEM-0001",111,34238,"FMN-USFMKWPT-MB","FMN 78% Mn Std 7.5% C US in whs ","Ferro-Mn 78% Mn standard 7.5% C US in warehouse Pittsburgh $ per long ton       "]
["MB-FES-0003",1543,34239,"FSI-BBLMWPTI-MB","MB FSI Lmpy 75% whs Pitts Imp   ","Metal Bulletin Ferro-Silicon Lumpy 75% in Warehouse Pittsburgh Import Price/US  "]
["MB-SIM-0005",1542,34242,"SMN-USIWPT-MB","SMN US in whs Pittsburgh        ","Silico-manganese United States in warehouse Pittsburgh $ per lb                 "]
["","",34243,"EX-LMDUSDGBP-MB","LME Stl. conversion rate $/GBP  ","LME Settlement conversion rate $/GBP                                            "]
["","",34245,"EX-LMDUSDYEN-MB","LME Stl. conversion rate $/YEN  ","LME Settlement conversion rate $/YEN                                            "]
["","",34246,"EX-LMDUSDEUR-MB","LME Stl. conversion rate $/EURO ","LME Settlement conversion rate $/EURO                                           "]
["MB-W-0001",179,34247,"W-APTEUF-MB","W APT European $ per mtu        ","W APT European $ per mtu                                                        "]
["MB-SB-0001",22,34248,"SB-MBIWRDM-MB","Sb MB  in whs RDM max 100 ppm Bi","Antimony MB $ per tonne in warehouse Rotterdam max 100 ppm Bi                   "]
["MB-BI-0001",30,34249,"BI-MBTNIW-MB","Bi MB in whs $ per lb           ","Bismuth MB tonne lots in warehouse $ per lb                                     "]
["MB-CD-0001",36,34250,"CD-MBINW-MB","Cadmium min 99.95% MB in whs    ","Cadmium min 99.95% MB Cts per lb in warehouse                                   "]
["MB-CD-0002",37,34251,"CD-MBINW2-MB","Cadmium min 99.99% MB in whs    ","Cadmium min 99.99% MB Cts per lb in warehouse                                   "]
["MB-GER-0001",126,34252,"GE-MBDISP-MB","MB Ge Dioxide 99.99% Spt Prc    ","Metal Bulletin Germanium Dioxide 99.99% Spot Price                              "]
["MB-In-0002",138,34253,"IN-INGMBW-MB","Indium Ings MB $ per kilo in whs","Indium Ingots MB $ per kilo in warehouse                                        "]
["MB-MN-0001",142,34254,"MN-MBELFLW-MB","Mn min 99.7% elec flake whs     ","Manganese min 99.7% electrolytic manganese flake MB $ per tonne in warehouse    "]
["MB-HG-0001",143,34256,"HG-MBFLIW-MB","Mercury MB $ per flask in whs   ","Mercury MB $ per flask in warehouse                                             "]
["MB-SE-0002",162,34257,"SE-MBIW-MB","Selenium MB $ per lb in whs     ","Selenium MB $ per lb in warehouse                                               "]
["MB-CO-0004",1070,34258,"CO-HGMBFMKW-MB","Co High grd MB free market  whs ","Cobalt High Grade MB free market $ per lb in warehouse                          "]
["MB-CO-0005",1071,34259,"CO-LGMBFMKW-MB","Co Low grd MB free market in whs","Cobalt Low Grade MB free market $ per lb in warehouse                           "]
["","",34260,"CD-MBINWMA-MB","Cadmium 99.95% min MB in whs MAv","Cadmium 99.95% min MB Cts per lb in warehouse Monthly average                   "]
["","",34261,"CD-MBINWMA2-MB","Cadmium 99.99% min MB in whs MAv","Cadmium 99.99% min MB Cts per lb in warehouse Monthly average                   "]
["","",34262,"CO-MBIWMA-MB","Cobalt 99.8% min MB in whs MAv  ","Cobalt High Grade MB $ per lb in warehouse Monthly average                      "]
["","",34263,"GE-DIMBMA-MB","Germanium Dioxide MB MAv        ","Germanium Dioxide MB $ per kilo Monthly average                                 "]
["","",34264,"W-APTEUFMA-MB","W APT EU FrMrkt $/mtu MAv       ","W APT European free market $/mtu Monthly Avg                                    "]
["","",34266,"FV-EUDSTMA-MB","FV basis 70-80% major EU dst MAv","Ferro-vanadium basis 70-80% V major EU destinations $ per kg V Monthly Average  "]
["","",34267,"ALA-LM3MSDO-MB","AL Alloy 3M slr LME Dly Ofc MAvg","Aluminium Alloy 3 months seller LME Daily Official $/tonne Monthly Average      "]
["","",34268,"CO-LGMBMWMA-MB","Co Low grd MB free mrkt whs MAv ","Cobalt Low Grade MB free market $ per lb in warehouse Monthly average           "]
["","",34269,"RH-EURMA-MB","Rhodium min 99.9% EU MAv        ","Rhodium min 99.9% European $ per troy oz Monthly average                        "]
["MB-AS-0001",29,34271,"AS-MBIWAR-MB","Arsenic MB $ per lb in whs      ","Arsenic MB $ per lb in warehouse                                                "]
["MB-MG-0001",141,34272,"MG-MBMIN-MB","Magnesium MB min $ per tonne    ","Magnesium MB min $ per tonne                                                    "]
["MB-AL-0271",1698,34273,"ALA-LMCSDO-MB","Al Aly Cash LME Dly Ofc         ","Aluminium Alloy Cash LME Daily Official $/tonne                                 "]
["MB-AL-0271",1698,34274,"ALA-LM3MDO-MB","Al Aly 3 Mnts LME Dly Ofc       ","Aluminium Alloy 3 months LME Daily Official $/tonne                             "]
["MB-AL-0274",1709,34275,"ALA-LMCSDU-MB","Al Aly Cash LME Dly Unofc.      ","Aluminium Alloy Cash LME Daily Unofficial $/tonne                               "]
["MB-AL-0274",1709,34276,"ALA-LM3MDU-MB","Al Aly 3 Mnts LME Dly Unofc.    ","Aluminium Alloy 3 months LME Daily Unofficial $/tonne                           "]
["MB-CU-0350",1692,34277,"CU-LMCSDO-MB","Cu Cash LME Dly Ofc             ","Copper Cash LME Daily Official $/tonne                                          "]
["MB-CU-0350",1692,34278,"CU-LM3MDO-MB","Cu 3 Mnts LME Dly Ofc           ","Copper 3 months LME Daily Official $/tonne                                      "]
["MB-CU-0351",1703,34279,"CU-LMCSDU-MB","Cu Cash LME Dly Unofc.          ","Copper Cash LME Daily Unofficial $/tonne                                        "]
["MB-CU-0351",1703,34280,"CU-LM3MDU-MB","Cu 3 Mnts LME Dly Unofc.        ","Copper 3 months LME Daily Unofficial $/tonne                                    "]
["MB-PB-0068",1707,34281,"PB-LMCSDU-MB","Lead Cash LME Dly Unofc.        ","Lead Cash LME Daily Unofficial $/tonne                                          "]
["MB-PB-0068",1707,34282,"PB-LM3MDU-MB","Lead 3 Mnts LME Dly Unofc.      ","Lead 3 months LME Daily Unofficial $/tonne                                      "]
["","",34288,"EX-LMAUSDEUR-MB","LME Stl. convert rate $/Eur MAvg","USD/GBP LME Settlement Currency Conversion Rates Monthly Average                "]
["","",34289,"SN-LM3MSDO-MB","Tin 3 Mnts sel. LME Dly Ofc MAvg","Tin 3 months seller LME Daily Official $ per tonne Monthly average              "]
["","",34292,"ALA-LMSTLDO-MB","Al Aly Stl. LME Dly Ofc MAvg    ","Aluminium Alloy Settlement LME Daily Official $ per tonne Monthly Average       "]
["MB-FEO-0002",115,34293,"FMO-USWRPT-MB","FMO 65/70% Mo US Pittsburgh whs ","Ferro-molybdenum 65/70% Mo US Pittsburgh $ per lb in warehouse                  "]
["MB-FEV-0002",123,34294,"FV-MBUSFMKS-MB","MB FV U.S FrMrkt 70-80% Spt Prc ","Metal Bulletin (MB) Ferro-Vanadium U.S Free Market 70-80% Spot Price USD/lb     "]
["","",34297,"TI-MBSPEUW-MB","Ti Sponge TG 12 x 70mm EU MB whs","Titanium Sponge TG 12 x 70mm European MB $ per kg in warehouse min 1 tonne lots "]
["","",34298,"CU-LMCSDOHL-MB","Cu Cash LME Dly Ofc H-L MAvg    ","Copper Cash LME Official low/high cumulative $ per tonne Monthly average        "]
["","",34303,"CU-LMSTLDO-MB","Cu Stl. LME Dly Ofc MAvg        ","Copper Settlement LME Daily Official $ per tonne Monthly Average                "]
["","",34304,"CU-LM3MSLHCM-MB","Cu 3Mnt seller Ofc L/H CurMnt Cm","LME Copper 3 months seller Official Low/High Jan current month cumulat $/tonne  "]
["","",34305,"CU-LM3MSDO-MB","Cu 3M seller LME Dly Ofc MAvg   ","Copper 3 months seller LME Daily Official $ per tonne Monthly average           "]
["","",34306,"PB-LMCSOHL-MB","Lead Csh LME Ofc L/H Jan CMt Cm ","LME Lead Cash Official Low/High Jan current month (cumulative) $/tonne          "]
["","",34309,"PB-LMCSDO-MB","Lead Cash LME Dly Ofc MAvg      ","Lead Cash LME Daily Official Monthly Average $ per tonne                        "]
["","",34310,"PB-LM3MDO-MB","Lead 3 Mnts LME Dly Ofc MAvg    ","Lead 3 months LME Daily Official $ per tonne Monthly Average                    "]
["","",34311,"PB-LMSTLDO-MB","Lead Stl. LME Dly Ofc MAvg      ","Lead Settlement Daily Official $ per tonne Monthly Average                      "]
["","",34312,"PB-LM3MSDO-MB","Lead 3M sellers LME Dly Ofc MAvg","Lead 3 months sellers LME Daily Official $ per tonne Monthly average            "]
["MB-PB-0067",1696,34320,"PB-LMCSDO2-MB","Lead Cash LME Dly Ofc           ","Lead Cash LME Daily Official $/tonne                                            "]
["MB-STE-0087",193,34322,"ST-SCPSUKDD-MB","Steel Scp OA Plate struc UK d/d ","Steel Scrap OA Plate and structural United Kingdom d/d consumer GBP/tonne       "]
["MB-STE-0077",182,34324,"ST-SCOUKDD-MB","Steel Scp1 Old steel UK d/d cons","Steel Scrap 1 Old steel United Kingdom d/d consumer GBP/tonne                   "]
["MB-STE-0080",185,34327,"ST-SC4ABUKMD-MB","Steel Scp 4ANw steel bale UK d/d","Steel Scrap 4A New steel bales United Kingdom d/d consumer GBP/tonne            "]
["MB-STE-0081",186,34328,"ST-SC4CBUKMD-MB","Steel Scp 4CNw steel bale UK d/d","Steel Scrap 4C New steel bales United Kingdom d/d consumer GBP/tonne            "]
["MB-STS-0012",187,34329,"ST-SC5CCUKMD-MB","Steel Scp 5C Od lght comp UK d/d","Steel Scrap 5C Old light compressed United Kingdom d/d consumer GBP/tonne       "]
["MB-STE-0082",188,34330,"ST-SC7BHUKMD-MB","The record could not be found","The record could not be found"]
["MB-STE-0083",189,34331,"ST-SC8ALUKMD-MB","Steel Scp 8A Nw light cut UK d/d","Steel Scrap 8A New loose light cuttings United Kingdom d/d processor GBP/tonne  "]
["MB-STE-0084",190,34332,"ST-SC8BLUKMD-MB","Steel Scp 8B Nw light cut UK d/d","Steel Scrap 8B New loose light cuttings United Kingdom d/d processor GBP/tonne  "]
["MB-STE-0078",183,34337,"ST-SCIBUKDD-MB","Steel Scp Cast Iron borng UK d/d","Steel Scrap 11A Cast iron borings (low phos) UK d/d consumer GBP/tonne          "]
["MB-STE-0098",208,34344,"ST-SCSHRBMF-MB","Steel Scp Shredded fob RDM      ","Steel Scrap Shredded fob Rotterdam $ per tonne                                  "]
["","",34350,"FMN-CHKFCNP-MB","The record could not be found","The record could not be found"]
["MB-FEH-0001",117,34351,"FSI-MBMCNPF-MB","MB FI 75% Bs fob MnCN Prt Prc/HK","Metal Bulletin Ferro-Silicon 75% Basis fob Main Chinese Ports Price/Hong Kong   "]
["","",34352,"SMN-HKCNPF-MB","The record could not be found","The record could not be found"]
["","",34354,"FW-HKFCNP-MB","The record could not be found","The record could not be found"]
["MB-SI-0002",255,34357,"SI-HKCNPF-MB","Silicon min98.5% HK fob CN port ","Silicon min 98.5% Hong Kong fob main Chinese ports $ per tonne                  "]
["MB-W-0003",260,34358,"W-APTCNF-MB","W APT CN HK fob Huangpu port    ","W APT Chinese Hong Kong fob Huangpu port in Guangdong Province USD/MTU          "]
["MB-STE-0195",338,34359,"ST-USIWRD-MB","USA imp wire rod lwcarb cfr Gulf","USA import wire rod (low carbon) $ per short ton cfr Gulf                       "]
["MB-STE-0159",287,34360,"ST-CNIMCRC-MB","The record could not be found","The record could not be found"]
["MB-STE-0010",39,34361,"ST-CNIMGLS-MB","The record could not be found","The record could not be found"]
["MB-STE-0011",42,34364,"ST-CISEBLB-MB","CIS export billet fob Black Sea ","CIS export billet $ per tonne fob Black Sea                                     "]
["MB-STE-0015",48,34365,"ST-CISEREBB-MB","CIS export rebar fob Black Sea  ","CIS export rebar $ per tonne fob Black Sea                                      "]
["MB-STE-0017",50,34366,"ST-CISEWRDB-MB","CIS export wire rod fob BlackSea","CIS export wire rod (mesh quality) $ per tonne fob Black Sea                    "]
["MB-STE-0016",49,34367,"ST-CISESLBB-MB","CIS export slab fob Black Sea   ","CIS export slab $ per tonne fob Black Sea                                       "]
["MB-STE-0013",44,34368,"ST-CISEHPLTB-MB","CIS export HvPlate fob Black sea","CIS export heavy plate (10-50mm) $ per tonne fob Black Sea                      "]
["MB-STE-0014",45,34369,"ST-CISEHRCB-MB","CIS export HRC fob Black sea    ","CIS export hot rolled coil $ per tonne fob Black Sea                            "]
["MB-STE-0012",43,34370,"ST-CISECRCB-MB","CIS Export CRC fob Black Sea    ","CIS export cold rolled coil $ per tonne fob Black Sea                           "]
["MB-PB-0057",1546,34371,"PB-HGINUSPM-MB","The record could not be found","The record could not be found"]
["MB-STE-0117",227,34380,"ST-TREBLTF-MB","Turkey export billet fob mn port","Turkey export billet $ per tonne fob main port                                  "]
["MB-STE-0119",230,34381,"ST-TREDEBF-MB","Turkey export Rebar fob main por","Turkey export rebar $ per tonne fob main port                                   "]
["MB-STE-0120",231,34382,"ST-TREWRDF-MB","Turkey export wirerod fob mn prt","Turkey export wire rod (mesh quality) $ per tonne fob main port                 "]
["","",34383,"ST-TREHRCF-MB","Turkey export HRC fob main ports","Turkey export hot rolled coil $ per tonne fob main port                         "]
["MB-AL-0014",15,34386,"AL-ASFIG1PB-MB","Al ScpFn Ing Gp1 Pure 99%mn UK  ","Aluminium Scrap and Foundry Ingots Group 1 Pure 99% min (baled) UK GBP/tonne    "]
["MB-AL-0011",12,34388,"AL-ASFICMP-MB","Al ScpFn Ing Comm pure cut UK   ","Aluminium Scrap and Foundry Ingots Commercial pure cuttings UK GBP/tonne        "]
["MB-AL-0009",10,34389,"AL-ASFICH9-MB","Al ScpFn Ing Clean HE9 extr. UK ","Aluminium Scrap and Foundry Ingots Clean HE9 extrusions UK GBP/tonne            "]
["MB-AL-0018",19,34390,"AL-ASFIMAL-MB","Al ScpFn Ing MxAly/OldRld cut UK","Aluminium Scrap and Foundry Ingots Mixed alloy/Old Rolled cuttings UK GBP/tonne "]
["MB-AL-0006",7,34391,"AL-ASFIBOR-MB","Al ScpFn Ing Baled Old Rolled UK","Aluminium Scrap and Foundry Ingots Baled Old Rolled UK GBP/tonne                "]
["MB-AL-0010",11,34392,"AL-ASFICM-MB","Al ScpFn Ing CommerciAl cast UK ","Aluminium Scrap and Foundry Ingots Commercial cast UK GBP/tonne                 "]
["MB-AL-0012",13,34393,"AL-ASFICMT-MB","Al ScpFn Ing Comm turng UK      ","Aluminium Scrap and Foundry Ingots Commercial turnings UK GBP/tonne             "]
["MB-AL-0015",16,34394,"AL-ASFIG7T-MB","Al ScpFn Ing Gp7 turng UK       ","Aluminium Scrap and Foundry Ingots Group 7 turnings UK GBP/tonne                "]
["","",34400,"CU-LMSTK-MB","LME Stocks Copper               ","LME Stocks Copper                                                               "]
["","",34401,"SN-LMSTK-MB","LME Stocks Tin                  ","LME Stocks Tin                                                                  "]
["","",34402,"PB-LMSTK-MB","LME Stocks Lead                 ","LME Stocks Lead                                                                 "]
["","",34403,"ZN-LMSTKSH-MB","LME Stocks Zinc SHG             ","LME Stocks Zinc SHG                                                             "]
["","",34404,"AL-LMHSTK-MB","LME Stocks Aluminium High Grade ","LME Stocks Aluminium High Grade                                                 "]
["","",34405,"ALA-LMSTK-MB","LME Stocks Aluminium Alloy      ","LME Stocks Aluminium Alloy                                                      "]
["","",34406,"NI-LMSTK-MB","LME Stocks Nickel               ","LME Stocks Nickel                                                               "]
["MB-AL-0346",2653,34407,"AL-IGPMDUWR-MB","\"Al P1020A,whs Rdm dt-unpd,spt L","Aluminium P1020A, in-warehouse Rotterdam duty-unpaid, spot low-high, $/tonne    "]
["","",34408,"CU-LMSTLDOG-MB","Cu Stl. LME Dly Ofc GBP/Ton MAvg","Copper Settlement LME Daily Official ú per tonne Monthly average                "]
["","",34409,"PB-LMSTLDOG-MB","Lead Stl. LME Ofc GBP/Ton MAvg  ","Lead Settlement LME Official ú per tonne Monthly average                        "]
["MB-AL-0002",3,34410,"AL-EBLTPRWR-MB","Al Exrsn BltPrm 6063EC in whsRDM","Aluminium Extrusion billet premium 6063 EC in warehouse Rotterdam $/tonne       "]
["","",34419,"CU-LM15MDO-MB","Cu 15 Mnts LME Dly Official     ","Copper 15 months LME Daily Official $/tonne                                     "]
["","",34431,"SN-LM15MDO-MB","Tin 15 Mnts LME Dly Ofc         ","Tin 15 months LME Daily Official $/tonne                                        "]
["","",34432,"SN-LM15MDU-MB","Tin 15 Mnts LME Dly Unofc.      ","Tin 15 months LME Daily Unofficial $/tonne                                      "]
["","",34439,"PB-LMSTLDO2-MB","Lead Stl. LME Dly Ofc           ","Lead Settlement LME Daily Official $/tonne                                      "]
["MB-AL-0285",1796,34441,"AL-ASFICMTD-MB","Al ScpFn Ing Comm Turng UK Disc ","Aluminium Scrap and Foundry Ingots Commercial Turnings UK MB LME Discounts      "]
["MB-AL-0286",1797,34442,"AL-ASFIG7TD-MB","Al ScpFn Ing Gp7 Turng UK Disc  ","Aluminium Scrap and Foundry Ingots Group 7 Turnings UK MB LME Discounts         "]
["MB-CU-0320",1584,34443,"CU-ELEWRDE-MB","Cu Electro (DEL) wirebar DE     ","Copper Electro (DEL) wirebar Germany Euro/tonne (VDM)                           "]
["MB-CU-0319",1583,34444,"CU-ELECADE-MB","Cu Electro cathodes DE          ","Copper Electro cathodes Germany Euro/tonne (VDM)                                "]
["MB-FET-0001",120,34445,"FTI-MBFMKEU-MB","FTI 70%(mx 4.5% Al FrMrkt d/d EU","Ferrotitanium 70% (max 4.5% Al) MB free market $/kg Ti d/d Europe               "]
["MB-MG-0002",253,34456,"MG-MBFCNSP-MB","MB MG 99.8% fob CN MnPrt Spt Prc","Metal Bulletin Magnesium 99.8% fob China Main Ports Spot Price                  "]
["","",34464,"SI-USFMKMA-MB","Silicon US FrMrkt Cents/lb MAv  ","Silicon US Free market Cents/lb Monthly Avg                                     "]
["","",34466,"SI-MBFMKMA-MB","Silicon MB FrMrkt  MAv          ","Silicon MB free market Euros/tonne Monthly Avg                                  "]
["","",34473,"MN-MBELFLWMA-MB","Mn 99.7% elec flake MB Mav whs  ","Manganese 99.7% electrolytic manganese flake MB Monthly Avg $/tonne in warehouse"]
["","",34499,"EX-LMSUSDEUR-MB","$/ ?Ç LME Stl Curr Cnvr Prc MAvg","USD/Euro LME Settlement Currency Conversion Rates Monthly Average               "]
["MB-AU-0008",1444,34500,"XAU-LONAM-MB","Gold London AM Dly Prc          ","Gold London Morning Daily price ú per troy oz                                   "]
["","",34501,"AL-HIGLMPMA-MB","Al HG 3Mnt m99.7 Ing EU LME P MA","Aluminium P1020A, in-warehouse Rotterdam duty-paid, for delivery 3M Fwd,MntAvg  "]
["MB-AU-0011",1722,34502,"XAU-CMXDST-MB","Gold CMX Dly Stl. Prc           ","Gold Comex Daily Settlement price $/troy oz                                     "]
["MB-AL-0048",411,34507,"AL-LMPRWSG-MB","\"Al P1020A,in-whs SGP,spt lowhig","Aluminium P1020A, in-warehouse Singapore, spot low-high, $/tonne                "]
["MB-AL-0016",17,34509,"AL-ASFILMPD-MB","Al ScpFn Ing LM24 Pr diec Ing UK","Aluminium Scrap and Foundry Ingots LM24 Pressure diecasting ingot UK GBP/tonne  "]
["MB-AL-0017",18,34510,"AL-SCFIGGDI-MB","Al ScrpFond Ing LM6/LM25 GrDc   ","Aluminium Scrap & Foundry Ingots LM6/LM25 Gravity diecasting ingot UK GBP/tonne "]
["MB-AL-0005",6,34511,"AL-EUFILMPD-MB","Al ScpFn Ing A380 Pr diec Ing EU","Aluminium Scrap and Foundry Ingots A380 Pressure diecasting ingot EU EUR/tonne  "]
["MB-CU-0003",404,34512,"CU-LMWPMSG-MB","Copper LME whs Prm Singapore    ","Copper LME warehouse premium Singapore                                          "]
["MB-PB-0008",420,34517,"PB-LMWPMSG-MB","The record could not be found","The record could not be found"]
["MB-ZN-0118",2650,34521,"ZN-LMWRPMSG-MB","Zn LME whs Prm Singapore        ","Zinc LME warehouse premium Singapore                                            "]
["MB-CU-0289",1468,34523,"CU-SHFUTEX-MB","Cu SHFE                         ","Copper Shanghai Futures Exchange Yuan/tonne                                     "]
["MB-CU-0405",2645,34526,"CU-LMGACSPM-MB","Cu LME grd A CIF Shanghai Prm   ","Copper LME Grade A CIF Shanghai premium indicator                               "]
["MB-AL-0272",1699,34542,"ALA-LMNCSDO-MB","Al Aly(NASAA) Cash LME Dly Ofc  ","Aluminium Alloy (NASAA) Cash LME Daily Official $/tonne                         "]
["MB-AL-0272",1699,34543,"ALA-LMN3MDO-MB","Al Aly(NASAA) 3Mnts LME Dly Ofc ","Aluminium Alloy (NASAA) 3 months LME Daily Official $/tonne                     "]
["MB-AL-0275",1710,34544,"ALA-LMNCSDU-MB","Al Aly(NASAA)Cash LME Dly Unofc ","Aluminium Alloy (NASAA) Cash LME Daily Unofficial $/tonne                       "]
["MB-AL-0275",1710,34545,"ALA-LMN3MDU-MB","Al Aly(NASAA)3Mnts LME Dly Unofc","Aluminium Alloy (NASAA) 3 months LME Daily Unofficial $/tonne                   "]
["","",34550,"ALA-LMNSTLDO-MB","Al Aly(NASAA) Stl. LME Dly Ofc  ","Aluminium Alloy (NASAA) Settlement LME Daily Official $/tonne                   "]
["MB-AL-0229",1467,34551,"AL-SHMTL-MB","Al Metal SHFE                   ","Aluminium Metal Shanghai Futures Exchange Rmb/tonne                             "]
["","",34555,"ALA-LMNSTK-MB","LME Stocks Aluminium Alloy NASSA","LME Stocks Aluminium Alloy (NASAA)                                              "]
["MB-CU-0321",1587,34558,"CU-WRBPH-MB","Cu Wirebar for Phalaborwa       ","Copper Wirebar for Phalaborwa South Africa Rand/tonne                           "]
["MB-IR-0004",1631,34559,"IR-JOMBS-MB","Iridium JohnsonMt. bs prc(unfab)","Iridium Johnson Matthey base price (unfab) $/troy oz                            "]
["MB-RU-0003",1634,34561,"RU-JOMBSP-MB","Ruthenium JohnsonMat. base price","Ruthenium Johnson Matthey base price (unfab) $/troy oz (0900 hrs)               "]
["MB-AU-0003",1439,34570,"XAU-HHUSD-MB","Gold Handy&Harman US Dly prc    ","Gold Handy & Harman US Daily price $/troy oz                                    "]
["MB-LI-0002",1755,34572,"LI-ORPEFDCE-MB","Li Ore Petalite 4.2% Li2O bagged","Lithium Ore Petalite 4.2% Li2O bagged fob Durban $/tonne cif Europe             "]
["MB-LI-0001",1754,34573,"LI-ORSPFCEU-MB","Li Ore Spodumene 7.25% Li2O     ","Lithium Ore Spodumene 7.25% Li2O fob $/tonne cif Europe                         "]
["MB-RUT-0002",1779,34576,"TI-ORRUCOF-MB","TiOr Rutile conc mn95% Baggd fob","Titanium Ore Rutile conc min 95% TiO2 Bagged US$/tonne fob/Aus                  "]
["MB-RUT-0001",1753,34577,"TI-ORRUBLF-MB","TiOr Rutile bulk conc mn95% fob ","Titanium Ore Rutile bulk conc min 95% TiO2 $ per tonne fob/Aus                  "]
["MB-ILM-0001",1752,34578,"TI-ORILBLF-MB","TiOr Ilmenite bulk conc m54% fob","Titanium Ore Ilmenite bulk conc min 54% TiO2 $/tonne fob/Australia              "]
["MB-CU-0311",1573,34579,"BR-IGBSSCB-MB","Br Ing 63/35(BS1400 SCB3) UK exw","Brass ingot 63/35 (BS1400 SCB3) UK GBP/tonne exworks                            "]
["MB-CU-0312",1574,34580,"BR-IGHTNUK-MB","Br Ing High Tensile HTB1 UK     ","Brass ingot High Tensile HTB1 (30 tonnes) UK                                    "]
["MB-CU-0314",1576,34581,"GN-INGLG4-MB","GunMtl Ing LG4 87/7/3/3 UK      ","Gunmetal Ingot LG4 87/7/3/3 UK GBP/tonne                                        "]
["MB-TI-0002",178,34597,"TI-SCTUUPMC-MB","Ti Scp Turng Unproc ovr05 mx2%Sn","Titanium Scrap Turnings Unprocessed (90/6/4) (over 05% max 2% Sn) $ per lb cif  "]
["MB-AU-0009",1651,34619,"XAU-MBCMXOI-MB","MB CMX Gold OI USD/ounce        ","MB Comex Gold Open Interest USD/ounce                                           "]
["MB-AG-0010",1650,34621,"XAG-MBNYOI-MB","MB Nymex XAG OI Cents/troy oz.  ","MB Nymex Silver open interest Cents/troy oz.                                    "]
["MB-AG-0011",1726,34622,"XAG-CMSSTLD-MB","XAG Spot Stl. CMX Dly Prcs      ","Silver Spot Settlement Comex daily prices Cents/troy oz                         "]
["MB-IR-0003",1630,34628,"IR-ENGBS-MB","Iridium Engelhard Base price    ","Iridium Engelhard Base price $/troy oz                                          "]
["MB-PD-0003",1480,34629,"XPD-ENGBSP-MB","Palladium Engelhard base price  ","Palladium Engelhard base price $/troy oz                                        "]
["MB-PT-0003",1484,34630,"XPT-ENGBSP-MB","Platinum Engelhard base price   ","Platinum Engelhard base price $/troy oz                                         "]
["MB-RH-0004",1633,34631,"RH-ENGBSP-MB","Rhodium Engelhard base price    ","Rhodium Engelhard base price $/troy oz                                          "]
["MB-RU-0004",1635,34632,"RU-ENGBSP-MB","Ruthenium Engelhard base price  ","Ruthenium Engelhard base price $/troy oz                                        "]
["MB-AL-0233",1551,34653,"AL-ASCFA3801-MB","Al ScpFn Ing A3801 Aly US d/d Mw","Aluminium Scrap and Foundry Ingot A-380.1 alloy US d/d Midwest $ per lb         "]
["MB-STS-0018",289,34662,"ST-SASGCRCC-MB","Asia 304 StnlShtCRC cif EsAS prt","Asia grade 304 stainless steel cold rolled coil (2mm 2B) $/T cif EAsian port    "]
["MB-STS-0017",288,34663,"ST-SASGHRSC-MB","Asia 304 StnlShtHRC cif EsAS prt","Asia grade 304 stainless steel hot rolled sheet $per tonne cif East Asian port  "]
["","",34666,"XAU-CMXDOI-MB","Gold CMX Dly OI $/troy oz       ","Gold Comex Daily open interest $/troy oz                                        "]
["","",34694,"CU-NYCMXST-MB","Nymex Comex Stocks Copper       ","Nymex Comex Stocks Copper                                                       "]
["","",34695,"XAU-NYCMXST-MB","Nymex CMX Stocks Gold           ","Nymex Comex Stocks Gold                                                         "]
["","",34697,"XPD-NYCMXST-MB","Nymex CMX Stocks Palladium      ","Nymex Comex Stocks Palladium                                                    "]
["","",34698,"XPT-NYCMXST-MB","Nymex CMX Stocks Platinum       ","Nymex Comex Stocks Platinum                                                     "]
["MB-PB-0001",140,35095,"PB-BTPMEUMKE-MB","Pb Btry Prm mn99.97% EU FrMrkt  ","Lead Battery premium min 99.97% European free market ex works euro/tonne        "]
["","",35096,"CU-STBRNFX-MB","The record could not be found","The record could not be found"]
["","",35097,"AL-STBRNFX-MB","The record could not be found","The record could not be found"]
["","",35098,"PB-STBRNFX-MB","The record could not be found","The record could not be found"]
["","",35099,"ZN-STBRNFX-MB","The record could not be found","The record could not be found"]
["","",35100,"NI-STBRNFX-MB","The record could not be found","The record could not be found"]
["","",35101,"SN-STBRNFX-MB","The record could not be found","The record could not be found"]
["MB-CU-0339",1643,35103,"CU-LMTPNAV-MB","Cu LME Tapo Notional AvgPrc(NAP)","Copper LME Tapo Notional Avg Price (NAP) $/tonne                                "]
["MB-FEC-0002",100,35116,"FCR-LWEUIW-MB","FCR 006008%C 65% Cr EU whs      ","Ferrochrome 006008%C 65% Cr European low carbon in warehouse $/lb Cr            "]
["MB-FEC-0013",1538,35117,"FCR-LWUSFPT-MB","FCR 005%C 65% min Cr lw carbon  ","Ferrochrome 005%C 65% min Cr low carbon US Free fob Pittsburgh $/lb Cr          "]
["MB-FEC-0014",1539,35118,"FCR-USFMLWP-MB","FCR 010%C 62% min Cr US FrMrkt  ","Ferrochrome 010%C 62% min Cr US Free market low carbon fob Pittsburgh $/lb Cr   "]
["MB-FEC-0015",1540,35119,"FCR-USFMLWP2-MB","FCR 015%C 60% min Cr US FrMrkt  ","Ferrochrome 015%C 60% min Cr US Free market low carbon fob Pittsburgh $/lb Cr   "]
["MB-FEM-0004",1541,35123,"FMN-USFMKMFP-MB","FMN 80% mn Mn 1.5 mx C US FrMrkt","Ferro-MN 80% min Mn 1.5 max C US free mkt medium carbon fob Pittsburgh $ per lb "]
["MB-AL-0278",1789,35139,"AL-ASFIG1LMD-MB","Al ScpFn Ing Gp1 Pur 99%mn UKDsc","Aluminium Scrap and Foundry Ingots Group 1 Pure 99% min UK MB LME Disc          "]
["MB-AL-0279",1790,35141,"AL-ASFICMPD-MB","Al ScpFn Ing Com Pure cut UK Dsc","Aluminium Scrap and Foundry Ingots Commercial Pure Cuttings UK MB LME Discounts "]
["MB-AL-0280",1791,35142,"AL-ASFICH9D-MB","Al ScpFn Ing Cln HE9 extr Disc  ","Aluminium Scrap and Foundry Ingots Clean HE9 Extrusions UK MB LME Discounts     "]
["MB-AL-0281",1792,35143,"AL-SCFIGMAL-MB","Al ScpFn Ing MxdAly MB LME Disc ","Aluminium Scrap & Foundry Ingots Mixed Alloy/Old Rolled Cuttings UK MB LME Disc "]
["MB-AL-0282",1793,35144,"AL-ASFIBORD-MB","Al ScpFn Ing B ORd UK MB LME Dsc","Aluminium Scrap and Foundry Ingots Baled Old Rolled UK MB LME Discounts         "]
["MB-AL-0283",1794,35145,"AL-ASFICMCD-MB","Al ScpFn Ing Comm Cast UK Disc  ","Aluminium Scrap and Foundry Ingots Commercial Cast UK MB LME Discounts          "]
["MB-AL-0237",1557,35147,"AL-ASFIAS12A-MB","Al ScpFn Ing AS 12 AFFIMET(FR)  ","Aluminium Scrap and Foundry Ingots AS 12 AFFIMET (France) Euro/tonne            "]
["MB-AL-0238",1558,35148,"AL-ASFIAS12U-MB","Al ScpFn Ing AS 12 UN AFFIMET(FR","Aluminium Scrap and Foundry Ingots AS 12 UN AFFIMET (France) Euro/tonne         "]
["MB-AL-0239",1559,35149,"AL-ASFIAS9UA-MB","Al ScpFn Ing AS 9 U3 AFFIMET(FR)","Aluminium Scrap and Foundry Ingots AS 9 U3 AFFIMET (France) Euro/tonne          "]
["MB-AL-0240",1560,35150,"AL-ASFIAS5UA-MB","Al ScpFn Ing AS 5 U3 AFFIMET(FR)","Aluminium Scrap and Foundry Ingots AS 5 U3 AFFIMET (France) Euro/tonne          "]
["MB-AL-0234",1554,35151,"AL-ASFID226-MB","Al ScrpFond Ing DIN 226         ","Aluminium Scrap and Foundry Ingots DIN 226                                      "]
["MB-AL-0235",1555,35152,"AL-ASFID231-MB","Al ScpFn Ing DIN 231 Germany    ","Aluminium Scrap and Foundry Ingots DIN 231 Germany Euro/1000kg (VDM)            "]
["MB-AL-0236",1556,35153,"AL-ASFID311-MB","Al ScpFn Ing DIN 311 Germany    ","Aluminium Scrap and Foundry Ingots DIN 311 Germany Euro/1000kg (VDM)            "]
["","",35159,"ST-SCWE2DEBD-MB","The record could not be found","The record could not be found"]
["","",35160,"ST-SCEE3DEBD-MB","The record could not be found","The record could not be found"]
["","",35161,"ST-SCSW1DEBD-MB","The record could not be found","The record could not be found"]
["","",35162,"ST-SCSE3DEBD-MB","The record could not be found","The record could not be found"]
["MB-PB-0058",1585,35166,"PB-VRSFDE-MB","Pb Virgin soft DE               ","Lead Virgin soft Germany Euro/tonne (VDM)                                       "]
["MB-ZN-0071",1586,35172,"ZN-VRNDE-MB","Zinc Virgin Germany             ","Zinc Virgin Germany Euro/tonne (VDM)                                            "]
["MB-CU-0327",1596,35175,"CU-SCWRDE-MB","Cu Scp Wire (Berry) DE          ","Copper Scrap Wire (Berry) Germany Euros per 1000 kg (VDM)                       "]
["MB-CU-0326",1595,35176,"CU-SCHVDE-MB","Copper Scrap Heavy Germany      ","Copper Scrap Heavy Germany euros/1000kg (VDM)                                   "]
["MB-CU-0325",1594,35177,"CU-ASHBRDE-MB","Cu Aly Scp Heavy brass DE       ","Copper Alloy Scrap Heavy brass Germany Euros/1000kg(VDM)                        "]
["MB-CU-0324",1593,35178,"CU-ASBT58RDE-MB","Cu Aly Scp Brass Trng(MS 58) DE ","Copper Alloy Scrap Brass Turnings (MS 58) Germany Euros/1000kg(VDM)             "]
["MB-CU-0328",1597,35179,"CU-ASBT63RDE-MB","Cu Aly Scp Brass Turng(MS 63) DE","Copper Alloy Scrap Brass Turnings (MS 63) Germany Euros/1000kg(VDM)             "]
["MB-AL-0255",1591,35180,"CU-SCELCTFR-MB","Cu Scp Electro cut FR           ","Copper Scrap Electro cuttings France Euros/1000kg (Lettre dInformation          "]
["MB-CU-0322",1589,35181,"CU-SCBRFR-MB","Cu Scp No1 Bright FR            ","Copper Scrap No1 Bright France Euros/1000kg (Lettre dInformation                "]
["MB-AL-0253",1588,35182,"CU-SCMFR-MB","Cu Scp Mixed (96%) FR           ","Copper Scrap Mixed (96%) France Euros/1000kg (Lettre dInformation               "]
["MB-AL-0254",1590,35183,"CU-SCBRPLFR-MB","Cu Scp Brass Plate cut 70/30 FR ","Copper Scrap Brass Plate Cuttings 70/30 France Euros/1000kg                     "]
["MB-CU-0323",1592,35184,"CU-SCBRTRFR-MB","Cu Scp Brass Turning FR         ","Copper Scrap Brass Turnings France Euros/1000kg (Lettre dInformation            "]
["MB-CU-0352",1714,35185,"CU-SCMBRFR-MB","Cu Scp Mixed Brass FR           ","Copper Scrap Mixed Brass France Euros/1000kg (Lettre dInformation               "]
["MB-CU-0333",1602,35186,"CU-SCELDDIT-MB","Cu Scp Electrolytic EN 12861 IT ","Copper Scrap Electrolytic dd EN 12861SCu2 Italy Euros/1000kg (Assomet)          "]
["MB-CU-0331",1600,35187,"CU-SCENWRIT-MB","Cu Scp Enmld wr EN 12861SCu3 IT ","Copper Scrap Enamelled wire EN 12861SCu3 tic Italy Euros/1000kg (Assomet)       "]
["MB-CU-0330",1599,35188,"CU-SCNWTUB-MB","Copper Scrap New from tubes     ","Copper Scrap New from tubes                                                     "]
["MB-CU-0334",1603,35189,"CU-SCOLTUB-MB","Copper Scrap Old from tubes     ","Copper Scrap Old from tubes                                                     "]
["MB-CU-0329",1598,35190,"CU-SCENCZIT-MB","Cu Scp EN 12861SCuZn1ACu63.5% IT","Copper Scrap EN 12861 S Cu Zn 1 A Cu 63.5% Italy Euros/1000kg (Assomet)         "]
["MB-CU-0332",1601,35191,"CU-SCMVAIT-MB","Cu Scp Mxd vlv EN 12861SCuZn6 IT","Copper Scrap Mixed from valves/taps EN 12861SCuZn6 Italy Euros/1000kg (Assomet) "]
["MB-CU-0335",1604,35192,"CU-SCSVIT-MB","Cu Scp 95% m/m 12861SCuZn7 IT   ","Copper Scrap Several 95% m/m 12861SCuZn7 Italy Euros/1000kg (Assomet)           "]
["MB-AL-0244",1564,35193,"AL-ASPCDE-MB","Al Scrap Pure cuttIng Germany   ","Aluminium Scrap Pure cuttings Germany Euros/1000kg (VDM)                        "]
["MB-AL-0247",1567,35194,"AL-ASH9EDE-MB","Al Scrap H9 extrusions Germany  ","Aluminium Scrap H9 extrusions Germany Euros/1000kg (VDM)                        "]
["MB-AL-0245",1565,35195,"AL-ASCMCDE-MB","Al Scrap CommerciAl cast Germany","Aluminium Scrap Commercial cast Germany Euros/1000kg (VDM)                      "]
["MB-AL-0246",1566,35196,"AL-SCATDE-MB","Al Scrap Alloy turnIng DE       ","Aluminium Scrap Alloy turnings Germany Euros/1000kg (VDM)                       "]
["MB-AL-0241",1561,35197,"AL-ASPCFR-MB","Al Scrap Pure cuttIng France    ","Aluminium Scrap Pure cuttings France Euros/1000kg (Lettre dInformation          "]
["MB-AL-0243",1563,35198,"AL-ASORFR-MB","Al Scrap Old rolled France      ","Aluminium Scrap Old rolled France Euros/1000kg (Lettre dInformation             "]
["MB-AL-0242",1562,35199,"AL-ASCMCFR-MB","Al Scrap CommerciAl cast France ","Aluminium Scrap Commercial cast France EU/1000kg (Lettre dInformation           "]
["MB-AL-0249",1569,35200,"AL-ASPCIT-MB","Al Scrap Pure cuttIng Italy     ","Aluminium Scrap Pure cuttings Italy Euros/1000kg (Assomet)                      "]
["MB-AL-0248",1568,35201,"AL-ASOMSCIT-MB","Al Scrap Old mixed scrap Italy  ","Aluminium Scrap Old mixed scrap Italy Euros/1000kg (Assomet)                    "]
["MB-AL-0250",1570,35202,"AL-ASCMCIT-MB","Al Scrap CommerciAl cast Italy  ","Aluminium Scrap Commercial cast Italy Euros/1000kg (Assomet)                    "]
["MB-SI-0001",166,35203,"SI-MBFMK-MB","Silicon MB FrMrkt Euros/tonne   ","Silicon MB free market Euros/tonne                                              "]
["MB-ZN-0069",1581,35216,"ZN-SCFIAZL3-MB","Zn ScpFn Ing Aly BrockZL3 Del UK","Zinc Scrap&Foundry Ingot alloy Brock ZL3 Deliv UK min 25 tonne lots GBP/tonne   "]
["MB-ZN-0070",1582,35217,"ZN-SCFIAZL5-MB","Zn ScpFn Ing Aly BrockZL5 Del UK","Zinc Scrap&Foundry Ingot alloy Brock ZL5 Deliv UK min 25 tonne lots GBP/tonne   "]
["","",35219,"ZN-SCFIUSEA-MB","The record could not be found","The record could not be found"]
["MB-CU-0008",409,35221,"CU-GAMBMKRDU-MB","Cu grdA Prt RDM frmrkt P DtyUpd.","Copper Grade A MB Port of  Rotterdam free market premium $/tonne duty unpaid.   "]
["","",35268,"FMO-EYFMKMA-MB","FMO 65 to 70% EU Free Mkt Mav   ","Ferro Molybdenum 65 to 70% European Free Mkt Monthly Avg  $/kg                  "]
["","",35269,"U-ORNWKSP-MB","The record could not be found","The record could not be found"]
["","",35270,"HG-MBFLIWMA-MB","HG MB $ per flask in whs MAv    ","Mercury MB $ per flask in warehouse Monthly Average  (flask equals 76.5 lbs)    "]
["MB-IRO-0003",92,35273,"ST-EUPIWC-MB","The record could not be found","The record could not be found"]
["MB-STS-0007",96,35285,"ST-SEUDCRSA-MB","EU dom 304 StlnlsSht CRC BasPrc ","Europe domestic grade 304 SS cold rolled sheet (2mm) base price Ç/T del         "]
["","",35316,"ZN-LM3MSDO-MB","Zn 3 Mnts seller LME Dly Ofc    ","Zinc 3 months seller LME Daily Official $/tonne                                 "]
["","",35379,"ST-BUDESC-MB","The record could not be found","The record could not be found"]
["","",35385,"AL-EUFMWDPMA-MB","Al EU FreeMktWhs LME DtyPd P MAv","Aluminium P1020A, in-warehouse Rotterdam duty-paid, spot monthly avg $/tonne    "]
["","",35386,"MG-CNFMKFAV-MB","Mg Mtl Chinese FrMrkt Avgs 99.8%","Magnesium Metal Chinese Free Market Avgs 99.8% fob China main ports $/tonne     "]
["MB-AU-0007",1443,35390,"XAU-MBLOPMP-MB","MB London Afternoon Gold prc    ","MB London Afternoon Gold price in British pound per troy ounce                  "]
["","",35456,"FV-USFMKT-MB","Ferro Vanadium US FrMrkt 70-80% ","Ferro-Vanadium US Free Market Ferro-Alloys  70-80% V                            "]
["","",35457,"EX-LMSUSDYEN-MB","LME Stl. convert rate $/YEN MAvg","LME Settlement conversion rate $/YEN Monthly Average                            "]
["","",35462,"ALA-LMCSMA-MB","Al NASSA LME Cash monthly avg   ","Non-Ferrous Metals Aluminium Metal NASSA Cash Monthly Average                   "]
["","",35463,"ALA-LM3MMA-MB","Al NASSA LME 3 months mntly avg ","Non-Ferrous Metals Aluminium Metal NASSA 3 months Monthly Average               "]
["","",35464,"ALA-LMSTLMA-MB","Al NASSA LME Settlemnt mntly avg","Non-Ferrous Metals Aluminium Metal NASSA Settlement Monthly Average             "]
["","",35465,"ALA-LM3SLRMA-MB","Al NASSA LME 3 mnt seller MAv   ","Non-Ferrous Metals Aluminium Metal NASSA 3 months sellers monthly average       "]
["","",35466,"AL-PIGDPMA-MB","Al EU DtyPd prs diec Ing prc MAv","Aluminium EU Duty paid pressure diecasing ingot price DIN 226/A380 EUR/MT MonAvg"]
["MB-CU-0337",1627,36097,"CU-MBCODPM-MB","Codleco Producer Prm            ","Metal Bulletin Codleco Producer Premium Non-Ferrous                             "]
["MB-IRO-0005",249,36098,"ST-LAMEPIVIF-MB","LatAM exp pig iron fob Vitor/Rio","Latin America exports pig iron $ per tonne fob Vitorio/Rio Brazil               "]
["MB-IRO-0006",250,36099,"ST-LAMEPIPOF-MB","LatAM exp pig iron fob PMadeira ","Latin America exports pig iron $ per tonne fob Ponta da Madeira Brazil          "]
["MB-STS-0006",95,36101,"ST-SEUDCRAS-MB","EU dom 304 StlnlsSht CRC Srchrg ","Europe domestic grade 304 SS cold rolled sheet (2mm) alloy surcharge Ç/T        "]
["MB-FE-0002",251,36102,"ST-LAMEHBQIF-MB","Venezuelan exp hot briq iron fob","Venezuelan export hot briquetted iron $ per tonne fob main port                 "]
["MB-IRO-0004",248,36103,"ST-USIPIMGC-MB","USA import pig iron cfr Gulf    ","USA import pig iron $ per tonne cfr Gulf                                        "]
["MB-NI-0003",148,36104,"NI-EUUNCTPRW-MB","Nickel Mtl EU uncut cathd Pr whs","Nickel Metal EU uncut cathodes premium indicator in warehouse Rotterdam $/tonne "]
["MB-NI-0001",146,36105,"NI-EUCTPRW-MB","Nickel Mtl EU cathd Prm indc whs","Nickel Metal EU 4x4 cathodes premium indicator in warehouse Rotterdam $/tonne   "]
["MB-NI-0002",147,36106,"NI-EUBTQPRW-MB","Nickel Mtl EU briqt Prm indc whs","Nickel Metal Europe briquettes premium indicator in warehouse Rotterdam $/tonne "]
["MB-AL-0013",14,36108,"AL-ASFFREU-MB","Al Scrap Floated Frag EU FreeMkt","Aluminium Scrap Floated Frag European Free Market euros/tonne                   "]
["MB-AL-0008",9,36109,"AL-EUFMMBAS-MB","Cast EU free market MB assessmnt","Cast European free market MB assessment euros/tonne                             "]
["MB-AL-0019",20,36110,"AL-MBEFMKTU-MB","Mixed Turng6% EU FrMrkt MB assmt","Mixed Turnings 6% European free market MB assessment euros/tonne                "]
["MB-STE-0163",293,36112,"ST-CNDREBS-MB","China Sth domestic rebar ex-ware","Southern China domestic rebar yuan per tonne ex-warehouse                       "]
["MB-STE-0165",295,36113,"ST-CNDWRDS-MB","China Sth domstc wirerod ex-ware","Southern China domestic wire rod (mesh quality) yuan per tonne ex-warehouse     "]
["MB-STE-0151",278,36114,"ST-CNDCRCS-MB","CN Southern domestic CRC        ","Southern China domestic cold rolled coil (0.5-2mm) yuan per tonne ex-warehouse  "]
["MB-STE-0150",277,36115,"ST-CNDHRCS-MB","CN Southern domestic HRC ex ware","Southern China domestic hot rolled coil (2mm) yuan per tonne ex-warehouse       "]
["MB-STE-0152",279,36116,"ST-CNDREBE-MB","China Est domestic rebar ex-ware","Eastern China domestic rebar yuan per tonne ex-warehouse                        "]
["MB-STE-0164",294,36117,"ST-CNDWRDE-MB","China Est domstc wirerod ex-ware","Eastern China domestic wire rod (mesh quality) yuan per tonne ex-warehouse      "]
["MB-STE-0153",280,36118,"ST-CNDCRCE-MB","CN Eastern domestic CRC         ","Eastern China domestic cold rolled coil (0.5-2mm) yuan per tonne ex-warehouse   "]
["MB-STE-0154",281,36119,"ST-CNDHRCE-MB","CN Eastern domestic HRC ex wareh","Eastern China domestic hot rolled coil (2mm) yuan per tonne ex-warehouse        "]
["MB-SB-0002",23,36155,"SB-MMSGWR-MB","Sb Mtl MMTA Std grdII whs RDM   ","Antimony Metal MMTA Standard Grade II $/tonne in warehouse Rotterdam            "]
["","",36156,"SB-MMSGWRMA-MB","Sb Mtl MMTA Std grdII whs RDM MA","Antimony Metal MMTA Standard Grade II $/tonne in warehouse Rotterdam Monthly Avg"]
["MB-FEC-0006",104,36157,"FCR-CNSBDP-MB","FCR CN Spt 6-8% C 60% Cr Dtypd  ","Ferro-Chrome China Spot 6-8% C basis 60% Cr delivered duty pd China RMB/tonne   "]
["MB-AL-0230",1473,36158,"AL-SHWKSTK-MB","Shanghai Aluminium Weekly Stocks","Shanghai Aluminium Weekly Stocks Deliverable/tonne                              "]
["MB-CU-0290",1474,36159,"CU-SHWKSTD-MB","Shanghai Copper Weekly Stocks   ","Shanghai Weekly Copper Stocks Deliverable per tonne                             "]
["MB-STE-0144",268,36162,"ST-CNEXFHRC-MB","CN Export HRC fob main port     ","China export hot rolled coil $ per tonne fob main port                          "]
["MB-ZN-0001",200,36172,"ZN-MBEUHRF-MB","Zn EU Special High grd fob      ","Zinc Metal MB EU Special High Grade fob Rotterdam $/tonne                       "]
["","",36177,"FTI-MBALDDEU-MB","MB FTI 70 max 4.5  Al d/d EU    ","Metal Bulletin Ferro-Titanium 70  max 4.5  Al USD/kg d/d Europe                 "]
["","",36178,"FW-WRRDMMA-MB","FW basis 75% W min MAv whs      ","Ferro-W basis 75% W min Monthly Average $/kg in warehouse Rotterdam             "]
["MB-FEW-0002",110,36179,"FMN-MBCNFM-MB","FMN MB CN FrMrkt min 7.5% Mn    ","Ferromanganese MB Chinese free market min 7.5% Mn                               "]
["MB-FES-0001",116,36180,"FSI-MBFMKWCN-MB","FSI CN FrMrkt min 75% whs       ","Ferrosilicon MB Chinese free market min 75% in warehouse China RMB/tonne        "]
["MB-W-0002",259,36181,"W-CNCNFMKW-MB","W conc MB CN FrMrkt 65% WO3 whs ","W concentrate MB Chinese free market 65% W03 in warehouse China RMB/mt          "]
["MB-MO-0002",258,36182,"MO-COCNFMKW-MB","Mo conc MB CN FrMrkt 45%Mo whs  ","Molybdenum concentrate MB Chinese free market 45% Mo in Warehouse China RMB/mtu "]
["MB-CO-0002",257,36183,"CO-CONCCNP-MB","The record could not be found","The record could not be found"]
["MB-In-0001",52,36184,"IN-MBCMKDUW-MB","The record could not be found","The record could not be found"]
["MB-STE-0079",184,36185,"ST-SCMBUKHST-MB","The record could not be found","The record could not be found"]
["MB-STE-0085",191,36186,"ST-SCMBUKLIR-MB","IrnStl Scp UK9A/10 Hvy Lght Irn ","Iron & Steel Scrap United Kingdom 9A/10 Heavy and light cast iron USD/MT        "]
["MB-STE-0086",192,36187,"ST-SCMBUKCBL-MB","IrnStl Scp UK 9B/C cyln blck Scp","Iron & Steel Scrap United Kingdom 9B/C cylinder block scrap USD/MT              "]
["MB-ALU-0001",1,36188,"AL-CHMTL-MB","Al Chinese NF Mtl CN Mtlrgcl grd","Alumina Chinese Non-Ferrous Metals Alumina Chinese Metallurgical grade RMB/MT   "]
["MB-SB-0003",24,36189,"SB-CNSTGDP-MB","NF Mtls Sb CN MMTA StdGrdII DtPd","Non-Ferrous Metals Antimony Chinese MMTA Standard Grade II del duty paid RMB/MT "]
["MB-MG-0003",254,36190,"MG-CNMMEW-MB","NF Mtls Mg CN min 99% Mg exwrk  ","Non-Ferrous Metals Magnesium Chinese min 99% Mg ex-works RMB/tonne              "]
["MB-SIM-0001",164,36191,"SMN-MNMSW-MB","NF SMN min 65% Mn max 17% Si whs","Non-Ferrous Silico-manganese min 65% Mn max 17% Si in warehouse RMB/MT          "]
["MB-STE-0479",1610,36197,"ST-BNUSHRCM-MB","StlBnchmrkr USA HRC EstMiss MT  ","SteelBenchmarker USA Hot rolled coil East of the Mississippi $per metric tonne  "]
["MB-STE-0477",1608,36198,"ST-BNUSHRCS-MB","StlBnchmrkr USA HRC EstMiss ST  ","SteelBenchmarker USA Hot rolled coil East of the Mississippi $ per short ton    "]
["MB-STE-0476",1607,36199,"ST-BNUSCRCM-MB","StlBnchmrkr USA CRC EstMiss MT  ","\"SteelBenchmarker USA cold rolled coil East of the Mississippi, $/metric tonne\" "]
["MB-STE-0474",1605,36200,"ST-BNUSCRCS-MB","StlBnchmrkr USA CRC Est Miss ST ","\"SteelBenchmarker USA cold rolled coil East of the Mississippi,$ per short ton\" "]
["MB-STE-0495",1715,36201,"ST-BNUSSPLTM-MB","StlBnchmrkr USA StPlate EMiss MT","SteelBenchmarker USA standard plate $ per tonne east of the Mississippi         "]
["MB-STE-0481",1612,36202,"ST-BNUSSPLTS-MB","StlBnchmrkr USA StPlate ST      ","SteelBenchmarker USA Standard plate $ per short ton                             "]
["MB-STE-0478",1609,36203,"ST-BNHRCCN-MB","StlBnchmrkr Mnlnd CN HRC        ","SteelBenchmarker Mainland China hot rolled coil $ per tonne                     "]
["MB-STE-0475",1606,36204,"ST-BNCRCCN-MB","StlBnchmrkr Mnlnd CN CRC        ","SteelBenchmarker Mainland China cold rolled coil $ per tonne                    "]
["MB-STE-0489",1620,36205,"ST-BNREBCN-MB","StlBnchmrkr Mnlnd China Rebar   ","SteelBenchmarker Mainland China rebar $ per tonne                               "]
["MB-STE-0482",1613,36206,"ST-BNSCNPLT-MB","StlBnchmrkr Mnlnd CN StPlate    ","SteelBenchmarker Mainland China standard plate $ per tonne                      "]
["","",36207,"ST-BNEUHRCD-MB","The record could not be found","The record could not be found"]
["","",36208,"ST-BNEUHRCE-MB","The record could not be found","The record could not be found"]
["MB-STE-0480",1611,36213,"ST-BNHRCWDE-MB","StlBnchmrkr HRC WLD Export Mkt  ","SteelBenchmarker Hot rolled coil World Export Market $ per tonne                "]
["","",36214,"ST-BNCRCWDE-MB","The record could not be found","The record could not be found"]
["MB-STE-0488",1619,36218,"ST-BNSUSESM-MB","SteelBnch ScpUSEst Shrd Scp MT  ","SteelBenchmarker scrap prices USA East of the Miss Shredded Scrap $/metric tonne"]
["MB-STE-0483",1614,36219,"ST-BNSUSEMM-MB","SteelBnch ScpUSEst HvMltng MT   ","SteelBenchmarker scrap prices USA East of Miss No 1 Heavy melting $/metric tonne"]
["MB-STE-0484",1615,36221,"ST-BNSUSEBM-MB","SteelBnch ScpUSEst Bushlng MT   ","SteelBenchmarker scrap prices USA East of the Miss No 1 Busheling $/metric tonne"]
["MB-RE-0002",151,36223,"RE-PELIWRDU-MB","NF Mtls Re whs RDM Dty Upd Plts ","Non-Ferrous Metals Rhenium in warehouse Rotterdam duty Unpaid Metal Pellets 99.9"]
["MB-RE-0001",150,36224,"RE-ACTIWRDU-MB","NF Mtls Re whs RDM DtUpd Ctlyc g","Non-Ferrous Metals Rhenium warehouse Rotterdam duty unpaid APR Catalytic grade  "]
["","",36226,"ST-BNUSREBS-MB","The record could not be found","The record could not be found"]
["MB-FEC-0005",103,36227,"FCR-CNCBDP-MB","FCR CN Cont 6-8% C 60% Cr Dtypd ","Ferro-Chrome China Contract 6-8% C basis 60% Cr delivered duty pd China RMB/ton "]
["MB-STE-0146",270,36228,"ST-CNEXHPLTF-MB","China export HvPlate fob mn port","China export heavy plate $ per tonne fob main port                              "]
["MB-STE-0009",38,36229,"ST-CNEXGCLF-MB","CN export GalvC fob main port   ","China export galvanized coil (1mm) $ per tonne fob main port                    "]
["MB-STE-0147",271,36230,"ST-CNEXREBF-MB","China export rebar fob main port","China export rebar $ per tonne fob main port                                    "]
["MB-STE-0148",272,36231,"ST-CNEXWRMF-MB","China export wirerod fob mn port","China export wire rod (mesh quality) $ per tonne fob main port                  "]
["MB-STS-0015",273,36232,"ST-CND3CRCW-MB","CN dom grd304 SSteel CRC in-ware","China domestic grade 304 SS cold rolled coil (2mm) yuan per tonne in-warehouse  "]
["MB-STS-0016",274,36233,"ST-CND2CRCW-MB","CN dom grd430 SSteel CRC in-ware","China domestic grade 430 2mm SS cold rolled coil yuan per tonne in-warehouse    "]
["MB-IRO-0007",276,36234,"ST-DCNPGIR-MB","China dom pig iron del warehouse","China domestic pig iron yuan per tonne del warehouse                            "]
["MB-STE-0149",275,36235,"ST-SCCNDHV-MB","IrnStl Scp CN Domestic HvScp    ","Iron & Steel Scrap China Domestic Heavy Scrap Yuan/metric tonne                 "]
["MB-STE-0458",1465,36236,"ST-DBREXWR-MB","Iran domestic Rebar ex-warehouse","Iran domestic rebar (12-25mm) million rials per tonne ex-warehouse Tehran       "]
["","",36237,"ST-EQLANG-MB","The record could not be found","The record could not be found"]
["","",36238,"ST-IBEMEXW-MB","The record could not be found","The record could not be found"]
["MB-STE-0457",1464,36239,"ST-HRPLTEXW-MB","Iran domestic HRPlate ex-ware.  ","Iran domestic hot rolled plate(15-40mm) million rials/tonne ex-warehouse Tehran "]
["MB-STE-0455",1462,36240,"ST-HRCEXW-MB","Iran domestic HRC exwareh Terhan","Iran domestic hot rolld coil (2-5mm) million rials pertonne ex-warehouse Tehran "]
["MB-STE-0452",1459,36241,"ST-CRCEXWR-MB","Iran domestic CRC exworks Terhan","Iran domestic CRC (0.5-1.25mm)million rials per tonne ex-warehouse Tehran       "]
["MB-STE-0450",1457,36242,"ST-HDPGAEW-MB","Iran domestic HtDpGalvC ex-ware ","Iran domestic hot-dip galvanized coil million rials/tonne ex-warehouse Tehran   "]
["","",36243,"ST-HOSSQR-MB","The record could not be found","The record could not be found"]
["MB-ZN-0059",1469,36244,"ZN-SHFUTEX-MB","Zinc Metal SHFE                 ","Non-Ferrous Metals Zinc Metal Shanghai Futures Exchange RMB/tonne               "]
["MB-ZN-0060",1475,36245,"ZN-SHWKSTD-MB","Zinc Shanghai Weekly Stocks     ","Non-Ferrous Metals Zinc Shanghai Zinc Weekly Stocks Deliverable per tonne       "]
["MB-STE-0440",1430,36246,"ST-INEXBLTF-MB","India export billet fob mn port ","India export billet $ per tonne fob main port                                   "]
["MB-STE-0439",1429,36247,"ST-INEXHPLTF-MB","India export HvPlate fob mn port","India export heavy plate (12-40mm) $ per tonne fob main port                    "]
["MB-STE-0442",1432,36248,"ST-INEXHRCGF-MB","India Export HRC fob main port  ","India export hot rolled coil (commodity) $ per tonne fob main port              "]
["MB-STE-0441",1431,36249,"ST-INEXGALF-MB","India Export HtDpGalvC fob mn pt","India export hot-dip galvanized coil $ per tonne fob main port                  "]
["MB-STE-0446",1436,36250,"ST-INIMHPLTC-MB","India import HvPlate cfr mn port","India import heavy plate (20-60mm) $ per tonne cfr main port                    "]
["MB-STE-0433",1422,36251,"ST-MBINDBLT1-MB","Indian domestic billet ex-works ","Indian domestic billet rupees per tonne ex-works                                "]
["MB-STE-0437",1427,36253,"ST-INDEMHPLT-MB","India domestic HvPlate exw      ","India domestic heavy plate rupees per tonne exw                                 "]
["MB-STE-0436",1425,36254,"ST-INDEMHRC-MB","India domestic HRC ex work      ","India domestic hot rolled coil rupees per tonne exw                             "]
["MB-STE-0434",1423,36255,"ST-INDEMGAL-MB","India domestic HtDpGalvC ex work","India domestic hot-dip galvanized coil rupees per tonne exw                     "]
["MB-STE-0444",1434,36256,"ST-INIMHRCGC-MB","India Import HRC cfr main port  ","India import hot rolled coil $ per tonne cfr main port                          "]
["MB-PB-0059",1621,36258,"PB-CACFRAV-MB","Pb Mtl Ca/Ca grid Lead Avg      ","Non-Ferrous Metals Lead Metal Ca/Ca grid lead (average) euros per tonne         "]
["MB-STE-0122",233,36263,"ST-MBICBLTC-MB","UAE import billet cfr Jebel Ali ","UAE import billet $ per tonne cfr Jebel Ali                                     "]
["MB-STE-0127",238,36264,"ST-MBICREBC-MB","UAE import rebar cfr Jebel Ali  ","UAE import rebar $ per tonne cfr Jebel Ali                                      "]
["MB-STE-0125",236,36265,"ST-MBICHRC-MB","UAE Import HRC cfr Jebel Ali    ","UAE import hot rolled coil $ per tonne cfr Jebel Ali                            "]
["MB-STE-0124",235,36266,"ST-MBCICRCG-MB","UAE Import CRC cfr Jebel Ali    ","UAE import cold rolled coil $ per tonne cfr Jebel Ali                           "]
["MB-STE-0447",1454,36268,"ST-IRIMSBLT-MB","Iran import billet cfr Nth ports","Iran import billet $ per tonne cfr northern ports                               "]
["MB-STE-0435",1424,36269,"ST-HRCINCE-MB","India domestic CRC exworks      ","India domestic cold rolled coil rupees per tonne ex-works                       "]
["MB-STE-0115",225,36273,"ST-MBCTRBLTE-MB","Turkey domestic billet exw      ","Turkey domestic billet $ per tonne exw                                          "]
["MB-STE-0118",229,36274,"ST-MBCTRREBE-MB","Turkey domestic rebar exw       ","Turkey domestic rebar $ per tonne exw                                           "]
["MB-STE-0121",232,36275,"ST-MBCTRWIRE-MB","Turkey domestic wire rod exwork ","Turkey domestic wire rod (mesh quality) $ per tonne exw                         "]
["MB-STE-0116",226,36276,"ST-IMBLTMBQC-MB","Turkey import billet cfr main po","Turkey import billet $ per tonne cfr main port                                  "]
["MB-STE-0105",215,36277,"ST-IMHRCMBQC-MB","Turkey import HRC cfr main port ","Turkey import hot rolled coil $ per tonne cfr main port                         "]
["MB-STE-0465",1531,36278,"ST-MBREBUCOW-MB","USA domestic rebar fob mill     ","USA domestic rebar $ per short ton fob mill                                     "]
["MB-STE-0471",1550,36279,"ST-WRDUSCAOD-MB","USA domestic wire rod fob mill  ","USA domestic wire rod (mesh quality) $ per short ton fob mill                   "]
["MB-STE-0467",1533,36280,"ST-PLTUSCAOR-MB","USA domestic Plate fob mill     ","USA domestic plate (up to 4 inches) $ per short ton fob mill                    "]
["MB-STE-0468",1534,36281,"ST-HRCUSCDW-MB","USA domestic HRC fob mill       ","USA domestic hot rolled sheet $ per short ton fob mill                          "]
["MB-STE-0469",1535,36282,"ST-CRCUCW-MB","USA domestic CRC fob mill       ","USA domestic cold rolled sheet $ per short ton fob mill                         "]
["","",36283,"ST-HDCMBUDW-MB","The record could not be found","The record could not be found"]
["","",36285,"ST-PLTEUOR-MB","The record could not be found","The record could not be found"]
["MB-STE-0160",290,36286,"ST-MBSCNDW-MB","China Sth domstc section ex-ware","Southern China domestic sections yuan per tonne ex-warehouse                    "]
["MB-STE-0156",283,36287,"ST-PLTSCNOR-MB","Chain Sth domestic plate ex-ware","Southern China domestic plate yuan per tonne ex-warehouse                       "]
["MB-STE-0072",168,36288,"ST-HDCMBSDW-MB","China Sth dom. HtDpGalvC ex-ware","Southern China domestic hot-dip galvanized coil yuan per tonne ex-warehouse     "]
["MB-STE-0161",291,36289,"ST-MBECNDW-MB","China Est domstc section ex-ware","Eastern China domestic sections yuan per tonne ex-warehouse                     "]
["MB-STE-0155",282,36290,"ST-PLTECNOR-MB","Chain Est domestic plate ex-ware","Eastern China domestic plate yuan per tonne ex-warehouse                        "]
["MB-STE-0021",55,36291,"ST-HDCMBEDW-MB","China Est dom. HtDpGalvC ex-ware","Eastern China domestic hot-dip galvanized coil yuan per tonne ex-warehouse      "]
["MB-STE-0108",218,36292,"ST-MBCTRHRCE-MB","Turkey domestic HRC ex works    ","Turkey domestic hot rolled coil $ per tonne exw                                 "]
["MB-STE-0109",219,36293,"ST-MBCTRCRCE-MB","TR domestic CRC ex works        ","Turkey domestic cold rolled coil $ per tonne exw                                "]
["MB-STE-0493",1702,36294,"ST-MBLM3BO-MB","LME Steel Billet 3 Mnt Official ","LME Steel Billet 3 Months Official $ per tonne                                  "]
["MB-STE-0494",1713,36295,"ST-LMBLM3MU-MB","LME Steel Billet 3 Mnt Unoffcial","LME Steel Billet 3 Months Unofficial $ per tonne                                "]
["","",36296,"ST-LMBLM15MO-MB","LME Steel Billet 15 Mnt Official","LME Steel Billet 15 Months Official $ per tonne                                 "]
["","",36299,"ST-LMSTBLMD-MB","LME Stocks Billet Mediterranian ","LME Stocks Total Billet Mediterranean $ per metric tonne                        "]
["","",36301,"ST-LMBLM15MU-MB","LME Steel Billet 15Mnt Unoffcial","LME Steel Billet 15 months unofficial $ per tonne                               "]
["MB-STE-0106",216,36306,"ST-IMCQCRC-MB","TR Import CRC cfr main port     ","Turkey import cold rolled coil $ per tonne cfr main port                        "]
["MB-FEC-0001",99,36309,"CR-MBLOWSUL-MB","MB - Low phosphorous Chrome 65% ","MB - Low phosphorous Chrome 65% USD/pound                                       "]
["MB-CHO-0001",40,36312,"CR-MBORCZA-MB","MB Cr Ore cif ZA UG2 grd bs 40% ","MB Chrome Ore cif South Africa SA UG2 Met grade basis 40% $ per tonne           "]
["MB-STE-0493",1702,36313,"ST-LMBLMCSO-MB","LME Steel Billet Cash Official  ","LME Steel Billet Cash Official $ per tonne                                      "]
["MB-STE-0494",1713,36314,"ST-LMBLCSU-MB","LME Steel Billet Cash Unofficial","LME Steel Billet Cash Unofficial $ per tonne                                    "]
["MB-FE-0001",228,36324,"ST-SCTREMBR-MB","Turkey exp MrchBar fob main port","Turkey export merchant bar $ per tonne fob main Turkish port                    "]
["","",36325,"PB-SHPMLM-MB","The record could not be found","The record could not be found"]
["MB-ZN-0119",2651,36326,"ZN-SHPMLM-MB","Zn LME CIF Shanghai Prm         ","CIF Shanghai premium LME Zinc $ per tonne                                       "]
["MB-STS-0005",94,36327,"ST-MBSBBBSP-MB","EU dom 304 StlnlsShtBar BasPrc  ","Europe domestic grade 304 stainless steel bright barbase price Ç per tonne del  "]
["MB-STS-0004",93,36328,"ST-MBSBBALS-MB","EU dom 304 StlnlsShtBar Srchrg  ","Europe domestic grade 304 stainless steel bright bar alloy surcharge Ç pertonne "]
["MB-STE-0112",222,36331,"ST-MBCCMQEG-MB","Egypt domestic rebar ex works   ","Egypt domestic rebar Eú per tonne exw                                           "]
["MB-IRO-0023",1426,36332,"ST-MBCCMQHB-MB","MB aprsl prc IN com qty CStl HBI","MB appraisal of prices India comm-quality carbon steel HBI rupees tonne ex works"]
["MB-SN-0002",176,36333,"SN-EUFMKPMS2-MB","EU FrMrkt Tin Prm spot 99.9%    ","European Free Market Tin premium spot 99.9% $ per tonne                         "]
["MB-SN-0001",175,36334,"SN-EUFMKPMS-MB","EU FrMrkt Tin Prm spot 99.85%   ","European Free Market Tin premium spot 99.85% $ per tonne                        "]
["","",36335,"CR-EULWAV-MB","The record could not be found","The record could not be found"]
["MB-CHO-0002",149,36336,"CR-ORCNPLU-MB","TR CrOre cfr CN prt -lmpy 40-42%","Turkish Chrome Ore cfr main Chinese ports - lumpy 40-42% - USD/tonne            "]
["MB-STE-0096",206,36338,"ST-SCMBTRIHC-MB","IrnStl Scp TR Imp MBasmt HMS    ","Iron & Steel Scrap Turkish ports import MB assessement cfr HMS 1&2 70:30mix     "]
["MB-STE-0095",205,36339,"ST-SCMBTRISC-MB","IrnStl Scp TR Imp MBasmt HMS Shr","Iron & Steel Scrap Turkish ports import MB assessement cfr Shredded $ per tonne "]
["MB-STE-0097",207,36340,"ST-SCMBRDEX-MB","IrnStl Scp RDM Exp MB assmt HMS ","Iron & Steel Scrap Rotterdam Export MB assessment HMS 1&2 (70:30) mix $/MT      "]
["","",36422,"P-CUING10-MB","Phosphor CU Ing 10% UK          ","Phosphor Copper Ingot 10% UK GBP/tonne                                          "]
["MB-STS-0010",180,36439,"ST-SCSSUKMDD-MB","Steel Scp 18/8 solid stnl UK d/d","Steel Scrap 18/8 solids stainless UK Merchants d/d customer/docks GBP/tonne     "]
["MB-STS-0011",181,36440,"ST-SCSTUKMDD-MB","Steel Scp 18/8 Turng stnl UK d/d","Steel Scrap 18/8 turnings stainless UK Merchants d/d customer/docks GBP/tonne   "]
["","",36444,"ST-SCSTUEUDD-MB","The record could not be found","The record could not be found"]
["MB-AL-0257",1642,36670,"AL-LMETAPAV-MB","Al LME Tapo NotionAl Avg (NAP)  ","Aluminium LME Tapo Notional Avg (NAP) $/tonne                                   "]
["","",36907,"ST-BNUSREBM-MB","StlBnchmrkr USA rebar Est Missi ","SteelBenchmarker USA rebar $ per tonne east of the Mississippi                  "]
["MB-STE-0486",1617,36921,"ST-BNSUSESG-MB","SteelBnch ScpUSEst Shrd Scp GrsT","SteelBenchmarker scrap prices USA East of the Miss Shredded Scrap $/gross ton   "]
["MB-PB-0060",1622,36960,"PB-MBCNT-MB","Pb Connector                    ","Metal Bulletin Connector lead Non-Ferrous euros per tonne                       "]
["MB-STE-0459",1466,36994,"ST-MBIRDBLT-MB","Iran import rebar cfr nth port  ","Iran import rebar $ per tonne cfr northern port                                 "]
["","",37113,"GN-INGG11-MB","GunMtl Ing G11 1/2 Pb UK        ","Gunmetal Ingot G11 1/2 Pb UK GBP/tonne                                          "]
["","",37114,"P-BRING-MB","Phosphor Bronze Ing             ","Phosphor Bronze Ingot                                                           "]
["","",37116,"P-CUING15-MB","Phosphor CU Ing 15% P           ","Phosphor Copper Ingot 15% P GBP/tonne                                           "]
["","",37117,"AL-BRAB1-MB","Al Bronze AB1                   ","Aluminium Bronze AB1 UK GBP/tonne                                               "]
["","",37118,"AL-BRAB2-MB","Al Bronze AB2                   ","Aluminium Bronze AB2 UK GBP/tonne                                               "]
["","",37474,"AL-SCFIGDI-MB","The record could not be found","The record could not be found"]
["","",37612,"ST-BNWDSPLT-MB","StlBnchmrkr Wld export StPlate  ","SteelBenchmarker World Export standard plate $ per tonne                        "]
["MB-STE-0487",1618,37616,"ST-BNSUSEMG-MB","SteelBnch ScpUS Est HvMltng GrsT","SteelBenchmarker scrap prices USA East of Miss No 1 Heavy melting $/gross ton   "]
["MB-STE-0485",1616,37618,"ST-BNSUSEBG-MB","SteelBnch ScpUSEst Bushlng GrsT ","SteelBenchmarker scrap prices USA East of the Miss No 1 Busheling  $/gross ton  "]
["MB-STE-0443",1433,37644,"ST-INIMCRC-MB","India Import CRC cfr main port  ","India import cold rolled coil $ per tonne cfr main port                         "]
["MB-PB-0062",1624,37651,"PB-MBSOAVG2-MB","Soft Pb Average                 ","Metal Bulletin Soft lead Average Non-Ferrous Metals                             "]
["","",37698,"ST-LMBLF15MO-MB","LME Stl Blt Far East 15 Mnt Ofc ","15M Official Iron and Steel Iron & Steel LME Steel Billet Far East $ per tonne  "]
["","",37710,"FE-IOICNQIN-MB","Steel Iron Ore Idx 62% deliv CN ","\"Index of spot Mkt IO prices delivrd to Cn, Qingdao and 62% Fe US $/tonne Daily\""]
["MB-STE-0416",1396,37728,"FSC-MBINCIS-MB","MB F Scp Idx CFR Iskenderun     ","Metal Bulletin Ferrous scrap Index $ per tonne CFR Iskenderun                   "]
["MB-STE-0145",269,37729,"ST-CRCEXFCN-MB","CN Export CRC fob main port     ","China export cold rolled coil $ per tonne fob main port                         "]
["MB-CO-0015",1701,37730,"CO-LM3MO-MB","MB NF Co 3 Mnts min99.3% Ofc LME","MB Non-Ferrous Cobalt 3 months min 99.3% Official London Metal Exchange $/tonne "]
["","",37731,"CO-LM15MO-MB","NF Co min99.3% 15Mnts Ofc LME   ","Non-Ferrous Metals Cobalt Metal min 99.3% 15 months Official LME $ per tonne    "]
["MB-MO-0006",1700,37732,"MO-LM3MO-MB","MB NF Molybdenum 3 Mnts Ofc LME ","MB Non-Ferrous Molybdenum 3 Months Official London Metal Exchange $/tonne       "]
["","",37733,"MO-LM15MO-MB","NF Molybdenum 15 Mnts Ofc LME   ","Non-Ferrous Metals Molybdenum Metal 15 months Official LME $ per tonne          "]
["MB-STE-0100",210,37734,"FSC-MBEXUKF-MB","MB F Scp exp asmt Mn UK Prt HMS ","MB ferrous scrap export assessment $/tonne fob main UK port HMS 1&2 (80:20mix)  "]
["MB-STE-0099",209,37735,"FSC-MBFSEUSH-MB","MB F Scp exp asmt fob mn UK Shrd","Metal Bulletin UK ferrous scrap export assessment $/tonne fob main UK Shredded  "]
["MB-AL-0007",8,37736,"AL-MBSIGUKCW-MB","MB Mtl AL ScpFn Ing UK CastWheel","MB Metals Aluminium Scrap and Foundry Ingots United Kingdom Cast wheels         "]
["MB-AL-0284",1795,37737,"AL-MBSCWLMD-MB","MB ScpSec AL UK CstWheels disc  ","Metal Bulletin Scrap and Secondary Aluminium UK Cast wheels MB LME discount     "]
["MB-CO-0015",1701,37738,"CO-MBLMCSWO-MB","Co Mtl Cash Wld min99.3% Ofc LME","Cobalt Metal Cash World min 99.3% Official London Metal Exchange $ per tonne    "]
["MB-MO-0006",1700,37739,"MO-LMCSWO-MB","Mo Metal Cash World Ofc LME     ","Molybdenum Metal Cash World Official London Metal Exchange $ per tonne          "]
["","",37740,"CO-MBLMSTK-MB","LME Stocks Cobalt               ","LME Cobalt Stocks Total                                                         "]
["","",37741,"MO-MBLMSTK-MB","LME Stocks Molybdenum           ","LME Molybdenum Stocks Total                                                     "]
["MB-STE-0413",1381,42019,"ST-MBINIMC-MB","MB F Scp Indian Imp CFR NhavaSh ","MB Ferrous Scrap Indian Imports (80:20 mix) $/tonne cfr Nhava Sheva             "]
["","",42020,"ST-MBINISHC-MB","The record could not be found","The record could not be found"]
["MB-TE-0001",173,42021,"TE-MBFMKT-MB","NF Mtls Te Mtl MB FrMrkt mn99.5%","Non-Ferrous Metals Tellurium Metal MB free market min. 99.5%$/kg                "]
["MB-GA-0001",124,42022,"GA-MBFMKT-MB","Mtl Bulletin FrMrkt $/kg Gallium","Metal Bulletin free market $/kg Gallium                                         "]
["MB-STE-0421",1401,42024,"FSC-MBINCIN-MB","MB F Scp Idx CFR India Shredded ","Metal Bulletin Ferrous Scrap Index CFR India Shredded $/tonne                   "]
["MB-STE-0420",1400,42025,"FSC-MBINFRD-MB","MB F Scp Idx FOB RDM HMS 1&2    ","Metal Bulletin Ferrous Scrap Index FOB Rotterdam HMS 1&2 (80:20) $ per tonne    "]
["","",42026,"ST-MBCMBLCIN-MB","The record could not be found","The record could not be found"]
["","",42027,"ST-MBCMGALC-MB","The record could not be found","The record could not be found"]
["","",42028,"CO-CSHLCUM-MB","Co Mtl Cash high low(cumulative)","Cobalt Metal Cash high low (cumulative)                                         "]
["","",42029,"CO-MBM3HLCM-MB","Co Mtl 3 Mnt high low cm        ","Cobalt Metal 3 months high low                                                  "]
["","",42030,"CO-MBMTSTCM-MB","Co Mtl Settlement cumulative    ","Cobalt Metal Settlement high low                                                "]
["","",42031,"CO-MBM3SHLCM-MB","Co Mtl 3Mnt sellr high low cm   ","Cobalt Metal 3 months sellers high low                                          "]
["","",42032,"CO-MBLMCSAV-MB","Co Metal LME Cash average       ","Cobalt Metal LME Cash average                                                   "]
["","",42033,"CO-MBLM3MAV-MB","Co Metal LME 3 Mnts average     ","Cobalt Metal LME 3 months average                                               "]
["","",42034,"CO-MBLMSTAV-MB","LME Stl. average                ","Cobalt Metal LME Settlement average                                             "]
["","",42035,"CO-MBLM3MSAV-MB","Co Metal LME 3Mnts sellrs Avg   ","Cobalt Metal LME 3 months sellers average                                       "]
["","",42036,"MO-MBMTCSHL-MB","Mo Mtl Cash High Low            ","Molybdenum Metal Cash high low                                                  "]
["","",42037,"MO-MBM3HLCM-MB","Mo Mtl 3 Mnt high low cm        ","Molybdenum Metal 3 months high low                                              "]
["","",42038,"MO-STLHLCM-MB","Mo Mtl Settlement high low cm   ","Molybdenum Metal Settlement high low (cumulative)                               "]
["","",42039,"MO-3MNSHLCM-MB","Mo Mtl 3 Mnt sellers high low cm","Molybdenum Metal 3 months sellers high low (cumulative)                         "]
["","",42040,"MO-CSHAVG-MB","Mo Mtl Cash Average             ","Molybdenum Metal Cash Average                                                   "]
["","",42041,"MO-3MNAVG-MB","Mo Mtl 3 Mnt Average            ","Molybdenum Metal 3 months Average                                               "]
["","",42042,"MO-LMSTLAV-MB","Molybdenum Metal Stl. Avg       ","Molybdenum Metal Settlement Average                                             "]
["","",42043,"MO-3MNSAVG-MB","Mo Mtl 3 Mnt sellers Average    ","Molybdenum Metal 3 months sellers Average                                       "]
["MB-ALU-0002",1408,42047,"AL-NFINAUF-MB","Al Idx fob Australia            ","Non-ferrous metals alumina index fob australia $per tonne                       "]
["MB-IRO-0008",424,42048,"FE-ORDEQICN-MB","IronOre deliv to Qin CN 62%F Cnt","\"Index                                                                          "]
["MB-AL-0259",1646,42075,"AL-MBLMABN3U-MB","Al Asia BnchPrc 3Mnt LME UnOf   ","LME Asian Benchmark price Aluminium 3 Months Unofficial $ per tonne             "]
["MB-CU-0341",1647,42076,"CU-MBLMAB3MU-MB","Cu Asia BnchPrc LME 3Mnts Unofc ","LME Asian Benchmark price Copper 3 Months Unofficial $ per tonne                "]
["MB-ZN-0073",1648,42077,"ZN-MBLMABN3U-MB","Zinc Asia BnchPrc LME 3Mnt UnOf ","LME Asian Benchmark price Zinc 3 Months Unofficial $ per tonne                  "]
["MB-BI-0002",31,42081,"BI-MBCNDM-MB","MB BI MB China domestic mn99.99%","Metal Bulletin Bismuth MB China domestic min 99.99% RMB/tonne                   "]
["MB-GA-0002",125,42082,"GA-MBFMKCNF-MB","MB Gallium FrMrkt fob CN ports  ","MB Gallium free market fob Chinese ports RMB/kg                                 "]
["MB-In-0003",139,42083,"IN-MBCNDM-MB","MB Indium China dM min 99.99%   ","MB Indium China domestic min 99.99% RMB/kg                                      "]
["MB-SE-0003",163,42084,"SE-MBCNDM-MB","MB Selenium MB CN dm mn99.9%    ","MB Selenium MB China domestic min 99.9% RMB/kg                                  "]
["MB-SE-0001",161,42085,"SE-MBDICNDP-MB","MB Se dioxide MB CN dm mn98%    ","Metal Bulletin Selenium dioxide MB China domestic min 98 percent                "]
["MB-TE-0002",174,42086,"TE-MBCNDM-MB","MB Tellurium CN dm mn 99.99%    ","MB Tellurium China domestic min 99.99% RMB/kg                                   "]
["MB-GER-0003",128,42087,"GE-MBRDM-MB","MB NF Germanium RDM USD per kg  ","Metal Bulletin Non-Ferrous Metals Germanium Rotterdam USD per kg                "]
["MB-CO-0001",256,42088,"CO-MBCNDO-MB","Mb Co China domestic min 99 .8% ","MB Cobalt China domestic min 99 .8% RMB/tonne                                   "]
["MB-GER-0004",129,42089,"GE-MBMTCNDM-MB","MB Ge Mtl China dm mn99.999%    ","MB Germanium metal China domestic min 99.999% RMB/kg                            "]
["MB-GER-0002",127,42090,"GE-MBDICNDM-MB","The record could not be found","The record could not be found"]
["MB-CU-0008",409,42091,"CU-MBPRDCT-MB","Cu Prm RDM grd A cathode        ","MB Copper Premium Rotterdam Grade A cathode $ per tonne                         "]
["MB-CU-0003",404,42092,"CU-MBPSGCTLM-MB","Cu Pr SG grdA cathd calc Pr LME ","MB Copper premium Singapore Grade A copper cathode calculated premium LME spec  "]
["MB-CU-0006",407,42093,"CU-MBPSHCTLM-MB","Cu Pr Shn grdA cathd calc Pr LME","MB Copper premium Shanghai Grade A copper cathode calculated premium LME        "]
["MB-CU-0406",2646,42102,"CU-MBPLECLH-MB","Cu Pr Legh grdA cathd LowHig LME","MB Copper premium Leghorn Grade A copper cathode low high LME spec              "]
["MB-CU-0007",408,42103,"CU-MBPLECT-MB","Cu Pr Legh grdA cathd calc prm  ","MB Copper premium Leghorn Grade A copper cathode calculated premium $ per tonne "]
["","",42104,"CU-MBPGWCLH-MB","The record could not be found","The record could not be found"]
["","",42105,"CU-MBPGWCT-MB","The record could not be found","The record could not be found"]
["MB-CU-0404",2644,42106,"CU-MBPBUCLH-MB","Cu Pr Bsn grdA CU cathd LowHigh ","MB Copper premium Busan Grade A copper cathode low - high $ per tonne           "]
["MB-CU-0004",405,42107,"CU-MBPBUCT-MB","Cu Pr Bsn grdA CU cathd calc Prm","MB Copper premium Busan Grade A copper cathode calculated premium $ per tonne   "]
["MB-AL-0051",427,42113,"AL-MBRPPMLM-MB","\"Al P1020A,whs Rdm dt-unpd,spt W","Aluminium P1020A, in-warehouse Rotterdam duty-unpaid, spot weighted average     "]
["MB-AL-0048",411,42114,"AL-MBSGDIGLM-MB","\"Al P1020A,in-whs SGP,spot wt av","Aluminium P1020A, in-warehouse Singapore, spot weighted average, $/tonne        "]
["MB-AL-0344",2648,42115,"AL-MBGIGLHLM-MB","\"Al P1020A,cif,KR , spot LH\"    ","Aluminium P1020A, cif, Korea (Gwangyang or Busan), spot low-high, $/tonne       "]
["MB-AL-0049",412,42116,"AL-MBGINLMPM-MB","Al Pr JP Ing LH LME P1020A      ","Aluminium P1020A, cif Korea (Gwangyang or Busan), spot weighted avg, $/tonne    "]
["MB-AL-0047",410,42117,"AL-MBJOIGHLM-MB","\"Al P1020A,in-whs Joh,spt lowhig","Aluminium P1020A, in-warehouse Johor, spot low-high, $/tonne                    "]
["MB-AL-0047",410,42118,"AL-MBPJOIGLM-MB","\"Al P1020A,in-whs Joh,spot WA\"  ","Aluminium P1020A, in-warehouse Johor, spot weighted average $/tonne             "]
["MB-PB-0007",419,42125,"PB-MBRDPLHLM-MB","Pb 99.97 Rdm L/H BSEN 126591999 ","MB Rotterdam Primary lead of 99.97 purity low  high LME spec BS EN 126591999    "]
["MB-PB-0007",419,42126,"PB-MBRDPCLM-MB","Pb 99.97 Rdm LME BSEN 126591999 ","MB Rotterdam Primary lead of 99.97 purity calc premium LME spec BS EN 126591999 "]
["","",42127,"PB-MBPMBALH-MB","The record could not be found","The record could not be found"]
["","",42128,"PB-MBPMBAAV-MB","The record could not be found","The record could not be found"]
["MB-PB-0008",420,42129,"PB-MBSGPCPLM-MB","The record could not be found","The record could not be found"]
["","",42131,"NI-MBPMRDHL-MB","The record could not be found","The record could not be found"]
["","",42132,"NI-MBPMRD-MB","The record could not be found","The record could not be found"]
["","",42133,"NI-MBPMSGHL-MB","The record could not be found","The record could not be found"]
["","",42134,"NI-MBPMSG-MB","The record could not be found","The record could not be found"]
["MB-ZN-0016",418,42135,"ZN-MBRDLH-MB","Zn Prm RDM low-high             ","MB Zinc premium Rotterdam low-high $ per tonne                                  "]
["MB-ZN-0016",418,42136,"ZN-MBRDPM-MB","Zn Prm RDM calculated Prm       ","MB Zinc premium Rotterdam calculated premium $ per tonne                        "]
["MB-ZN-0014",416,42137,"ZN-MBSGPM-MB","Zn Prm Singapore calc Prm       ","MB Zinc premium Singapore calculated premium $ per tonne                        "]
["MB-ZN-0013",415,42138,"ZN-MBGWLH-MB","Zn Prm Gwang low-high           ","MB Zinc Premium Gwangyang low-high $ per tonne                                  "]
["MB-ZN-0013",415,42139,"ZN-MBGWPM-MB","Zn Prm Gwang calculated Prm     ","MB Zinc Premium Gwangyang calculated premium $ per tonne                        "]
["MB-ZN-0012",414,42140,"ZN-MBJOLH-MB","Zn Prm Johor low - high         ","MB Zinc premium Johor low - high $ per tonne                                    "]
["MB-ZN-0012",414,42141,"ZN-MBJOPM-MB","Zn Prm Joh calc Prm             ","MB Zinc premium Johor calculated premium $ per tonne                            "]
["","",42142,"ZN-MBCHLH-MB","The record could not be found","The record could not be found"]
["","",42143,"ZN-MBCHPM-MB","The record could not be found","The record could not be found"]
["MB-ZN-0015",417,42146,"ZN-MBSHPM-MB","Zn Prm Shanghai calc Prm        ","MB Zinc premium Shanghai calculated premium $ per tonne                         "]
["MB-NI-0143",2652,42147,"NI-MBSHDIGLM-MB","Nickel 99.8 Shg LH LME B39792008","MB premium Shanghai Primary nickel of 99.80 purity low  high LME spec B3979 2008"]
["MB-NI-0006",421,42148,"NI-MBSHPCPLM-MB","Nickel 99.80Shg cal LMEB39792008","MB Shanghai Primary nickel of 99.80 purity calculated prem LME spec B3979 2008  "]
["MB-AL-0345",2649,42149,"AL-MBSHDIGLM-MB","\"Al P1020A,cif Shg,spt low high\"","Aluminium P1020A, cif Shanghai, spot low-high, $/tonne                          "]
["MB-AL-0050",413,42150,"AL-MBSIGPLM-MB","\"Al P1020A,cif Shg,spot WAvg\"   ","Aluminium P1020A, cif Shanghai, spot weighted average, $/tonne                  "]
["","",42151,"GE-MBMTRDMA-MB","MB NF Mtl Germanium RDM MAv     ","MB Non-Ferrous Metal Germanium Rotterdam $ per kg Monthly Average               "]
["MB-STE-0445",1435,42152,"ST-MBINIHRC-MB","India Import HRC CR Grd cfr port","India import hot rolled coil (CR grade) $ per tonne cfr main port               "]
["MB-STE-0052",89,42153,"ST-MBEISREB-MB","EU import rebar cfr port Sth EU ","EU import rebar Ç per tonne cfr main EU port Southern Europe                    "]
["MB-STE-0054",91,42154,"ST-MBEISWRD-MB","EU import wire rod del Sth EU   ","EU import wire rod (mesh quality) Ç per tonne cfr main EU port Southern Europe  "]
["MB-STE-0050",87,42155,"ST-MBEISPLT-MB","EU import Plate 8-40 cfr SthEU  ","EU import Plate (8-40mm) Ç per tonne cfr main EU port Southern Europe           "]
["MB-STE-0047",84,42156,"ST-MBEUIHRC-MB","EU Import HRC cfr main prt SthEU","EU import Hot rolled coil Ç per tonne cfr main EU port Southern Europe          "]
["MB-STE-0045",82,42157,"ST-MBEISCRC-MB","EU Import CRC cfr main prt SthEU","EU import cold rolled coil Ç per tonne cfr main EU port Southern Europe         "]
["MB-STE-0048",85,42158,"ST-MBEISHDP-MB","EU import HtDpGalvC cfr Sth EU  ","EU import hot-dip galvanized coil Ç per tonne cfr main EU port Southern Europe  "]
["MB-STE-0051",88,42159,"ST-MBEINREB-MB","EU import rebar cfr port Nth EU ","EU import rebar Ç per tonne cfr main EU port Northern Europe                    "]
["MB-STE-0053",90,42160,"ST-MBEINWRD-MB","EU import wire rod cfr prt NthEU","EU import wire rod (mesh quality) Ç per tonne cfr main EU port Northern Europe  "]
["MB-STE-0049",86,42161,"ST-MBEINPLT-MB","EU import Plate 8-40 cfr NthEU  ","EU import Plate (8-40mm) Ç per tonne cfr main EU port Northern Europe           "]
["MB-STE-0046",83,42162,"ST-MBEINHRC-MB","EU Import HRC cfr main prt NthEU","EU import Hot rolled coil Ç per tonne cfr main EU port Northern Europe          "]
["MB-STE-0044",81,42163,"ST-MB-MB","EU Import CRC cfr main prt NthEU","EU import cold rolled coil Ç per tonne cfr main EU port Northern Europe         "]
["MB-STE-0091",201,42164,"ST-MBEINCRC-MB","EU import HtDpGalvC cfr Nth EU  ","EU import hot-dip galvanized coil Ç per tonne cfr main EU port Northern Europe  "]
["MB-STE-0037",73,42165,"ST-MBEDSREB-MB","EU domestic rebar del Sth EU    ","EU domestic rebar Ç per tonne del Southern Europe                               "]
["MB-STE-0043",79,42166,"ST-MBEDSWRD-MB","EU domestic wire rod del Sth EU ","EU domestic wire rod (mesh quality) Ç per tonne del Southern Europe             "]
["MB-STE-0039",75,42167,"ST-MBEDSMED-MB","EU domestc hlw section del SthEU","EU domestic hollow sections Ç per tonne del Southern Europe                     "]
["MB-STE-0035",71,42168,"ST-MBEDSPLT-MB","EU domestic Plate 8-40 exw SthEU","EU domestic plate (8-40mm) Ç per tonne ex-works Southern Europe                 "]
["MB-STE-0029",65,42169,"ST-MBEDSHRC-MB","EU domestic HRC exworks SthEU   ","EU domestic hot rolled coil Ç per tonne ex-works Southern Europe                "]
["MB-STE-0027",63,42170,"ST-MBEDSCRC-MB","EU domestic CRC exworks SthEU   ","EU domestic cold rolled coil Ç per tonne ex-works Southern Europe               "]
["MB-STE-0031",67,42171,"ST-MBEUDSHDG-MB","EU domestic HtDpGalvC exw Sth EU","EU domestic hot-dip galvanized coil Ç per tonne ex-works Southern Europe        "]
["MB-STE-0036",72,42172,"ST-MBEDNREB-MB","EU domestic rebar del Nth EU    ","EU domestic rebar Ç per tonne del Northern Europe                               "]
["MB-STE-0042",78,42173,"ST-MBEDNWRD-MB","EU domestic wire rod del Nth EU ","EU domestic wire rod (mesh quality) Ç per tonne del Northern Europe             "]
["MB-STE-0038",74,42174,"ST-MBEDNMED-MB","EU domestc hlw section del NthEU","EU domestic hollow sections Ç per tonne del Northern Europe                     "]
["MB-STE-0034",70,42175,"ST-MBEDNPLT-MB","EU domestic Plate 8-40 exw NthEU","EU domestic plate (8-40mm) Ç per tonne ex-works Northern Europe                 "]
["MB-STE-0028",64,42176,"ST-MBEUDNHRC-MB","EU domestic HRC exworks NthEU   ","EU domestic hot rolled coil Ç per tonne ex-works Northern Europe                "]
["MB-STE-0026",62,42177,"ST-MBEDNCRC-MB","EU domestic CRC exworks NthEU   ","EU domestic cold rolled coil Ç per tonne ex-works Northern Europe               "]
["MB-STE-0030",66,42178,"ST-MBEDNHDP-MB","EU domestic HtDpGalvC exw Nth EU","EU domestic hot-dip galvanized coil Ç per tonne ex-works Northern Europe        "]
["MB-STE-0073",169,42179,"ST-MBEISEREB-MB","EU Sth export rebar fob main prt","Southern Europe export rebar Ç per tonne fob main port                          "]
["MB-STE-0074",170,42180,"ST-MBEUWRDM-MB","EU Sth export wirerod fob mn prt","Southern Europe export wire rod (mesh quality) Ç per tonne fob main port        "]
["MB-IRO-0001",46,42181,"ST-MBCEXPIBT-MB","CIS exp pig iron Baltic Sea fob ","CIS export pig iron Baltic Sea $ per tonne fob main port                        "]
["MB-IRO-0002",47,42182,"ST-MBCEXPIBL-MB","CIS exp pig iron Black Sea fob  ","CIS export pig iron Black Sea $ per tonne fob main port                         "]
["MB-STS-0003",80,42183,"ST-MBSEUEXP-MB","EU exp 304 StnlsSht CRS fob NtEU","EU export grade 304 stainless steel cold rolled sheet (2mm) Ç/T fob N EU port   "]
["MB-STS-0008",97,42184,"ST-MBSEUSSC-MB","MB IrnStl Scp EU Cif Stnls solid","Metal Bulletin Iron & Steel Scrap Europe Cif Europe Stainless 18 8 solids       "]
["MB-STS-0009",98,42185,"ST-MBSEUSTC-MB","MB IrnStl Scp EU Cif Stnls Turng","Metal Bulletin Iron & Steel Scrap Europe Cif Europe Stainless 18/8 turnings     "]
["","",42193,"AL-MBPRDIGLM-MB","Al Ing Prm RDM LME P1020A MAv   ","Aluminium P1020A, in-warehouse Rotterdam duty un-paid spot weighted avg, MAvg   "]
["","",42194,"AL-SGPHLMA-MB","Al P1020A whsSG spt lowhigh MtAv","Aluminium P1020A, in-warehouse Singapore, spot low-high monthly average         "]
["","",42195,"AL-SGPWAMA-MB","Al P1020A whs SG spt WgAvg MtAv ","Aluminium P1020A, in-warehouse Singapore, spot weighted monthly average         "]
["","",42200,"AL-GWBSHLMA-MB","Al P1020A cifKR Spt lowhigh MtAv","Aluminium P1020A, cif, Korea (Gwangyang or Busan), spot low-high Mnt Avg        "]
["","",42201,"AL-JOHWAMA-MB","Al P1020A whs Johor WgAvg MtAv  ","\"Aluminium P1020A, in-warehouse Johor, spot weighted monthly average, $/tonne\"  "]
["","",42202,"AL-GWBSWAMA-MB","Al P1020A cif KR Spt WgAvg MtAv ","Aluminium P1020A, cif, Korea (Gwangyang or Busan), spot weighted Mnt Avg        "]
["","",42203,"AL-JOHHLMA-MB","Al P1020A whs Johor lowhigh MtAv","\"Aluminium P1020A, in-warehouse Johor, spot low-high monthly average, $/tonne\"  "]
["","",42206,"AL-SHHLMA-MB","Al P1020A cifSH Spt lowhigh MtAv","\"Aluminium P1020A, cif Shanghai, spot low-high monthly average, $/tonne\"        "]
["","",42207,"AL-SHWAMA-MB","Al P1020A cifSH Spt WgAvg MtAv  ","\"Aluminium P1020A, cif Shanghai, spot weighted average monthly average, $/tonne\""]
["","",42208,"CU-PRCLHLMA-MB","Cu Pr RDM grdA cathd LowHigh LME","MB RDM Grade A copper cathode LME spec BSEN 1978:1998(Cu-CATH-1) low-high MntAvg"]
["","",42209,"CU-PRCCLLMA-MB","Cu Pr RDM grdA cathd LowHigh Avg","MB RDM GradeA copper cathode LME spec BSEN 1978:1998(Cu-CATH-1) Calc Prem MntAvg"]
["","",42214,"CU-PBUCLHMA-MB","Cu Pr Bsn grdA cathd LowHigh MAv","MB Busan GradeA copper cathode LMEspecBSEN 1978:1998(Cu-CATH-1)low-high MntAvg  "]
["","",42215,"CU-PBUCTMA-MB","Cu Pr Bsn grdA cathd calc Pr MAv","MB Busan GradeA copper cathode LMEspecBSEN 1978:1998(Cu-CATH-1)Calc Prem MntAvg "]
["","",42222,"CU-PLECLHMA-MB","Cu Pr Legh grdA cathd LowHig MAv","MB Leghorn GradeA copper cathode LMEspecBSEN 1978:1998(Cu-CATH-1)low-high MntAvg"]
["","",42223,"CU-PLECTMA-MB","Cu Pr Legh grdA cathd calcPr Mav","MB Leghorn GradeA copper cathode LMEspecBSEN 1978:1998(Cu-CATH-1)Calc Prem MntAv"]
["","",42224,"CU-PSHCLHMA-MB","Cu Pr SH grdA cathd LowHigh MAv ","MB Shanghai GradeA copper cathode LMEspecBSEN 1978:1998(Cu-CATH-1)low-high MntAv"]
["","",42225,"CU-PSHCTMA-MB","Cu Pr SH grdA cathd calc Prm MAv","MB Shanghai GradeA copper cathode LMEspecBSEN 1978:1998(Cu-CATH-1)CalcPrem MntAv"]
["","",42226,"CU-PSGCLHMA-MB","Cu Pr SG grdA cathd LowHigh MAv ","MB SGP Grade A copper cathode LME spec BSEN 1978:1998(Cu-CATH-1) low-high MntAvg"]
["","",42227,"CU-PSGCTMA-MB","Cu Pr SG grdA cathd calc Prm MAv","MB SGP GradeA copper cathode LME spec BSEN 1978:1998(Cu-CATH-1) Calc Prem MntAvg"]
["","",42232,"PB-PSGLLHMA-MB","The record could not be found","The record could not be found"]
["","",42233,"PB-PSGLCLMA-MB","The record could not be found","The record could not be found"]
["","",42234,"PB-PRDLLHMA-MB","Pb Pr Rdm 99.97% LowHigh MAv    ","MB Lead prem Rotterdam 99.97% purity LME spec:BS EN 12659:1999 low-high MntAvg  "]
["","",42235,"PB-PRDLCLMA-MB","Pb Pr Rdm 99.97% calc prm MAv   ","MB Lead prem Rotterdam 99.97% purity LME spec:BS EN 12659:1999 calc prem MntAvg "]
["","",42238,"NI-PSHLLHMA-MB","MB Ni Pr SG 99.80% L-H MtAvg    ","MB Nickel Prem. Shanghai 99.80% LMEspec: B39:79 (2008) low-high MntAvg $/tonne  "]
["","",42239,"NI-PSHLCLMA-MB","MB Ni Pr SG 99.80% cal pr MtAvg ","MB Nickel Prem. Shanghai 99.80% LMEspec: B39:79 (2008) calc prem. MntAvg $/tonne"]
["","",42244,"ZN-MBSHLPMA-MB","Zn SH P MA LME BSEN11792003     ","MB Zinc Shanghai calculated premium monthly average LME spec BS EN 11792003     "]
["","",42246,"ZN-MBCHPLMA-MB","The record could not be found","The record could not be found"]
["","",42247,"ZN-MBGWLHLMA-MB","Zn Gwan LH M LME BSEN11792003   ","MB Zinc Premium Gwangyang low-high monthly average LME spec BS EN 11792003      "]
["","",42248,"ZN-MBGWPLMA-MB","Zn Gwang Pr MA LME BSEN11792003 ","MB Zinc Gwangyang calculated premium monthly average LME spec BS EN 11792003    "]
["","",42249,"ZN-MBJOLHMA-MB","Zn P Joh LH M LME BSEN11792003  ","MB Zinc Premium Johor low-high monthly average LME spec BS EN 11792003          "]
["","",42250,"ZN-MBJOPLMA-MB","Zn Joho cl P MA LME BSEN11792003","MB Zinc Johor calculated premium monthly average LME spec BS EN 11792003        "]
["","",42252,"ZN-MBNOLHMA-MB","The record could not be found","The record could not be found"]
["","",42253,"ZN-MBRDLHMA-MB","Zn RDM L/H MA LME BSEN11792003  ","MB Zinc Premium Rotterdam low-high monthly average LME spec BS EN 11792003      "]
["","",42254,"ZN-MBRDLPMA-MB","Zn RDM P MA LME BSEN11792003    ","MB Zinc Rotterdam calculated premium monthly average LME spec BS EN 11792003    "]
["","",42255,"ZN-MBSGLHLMA-MB","Zn P SG LH MA LMEBSEN11792003   ","MB Zinc Premium Singapore low-high monthly average LME spec BS EN 11792003      "]
["","",42256,"ZN-MBSGLPMA-MB","Zn SG Pr MA LME BSEN11792003    ","MB Zinc Singapore calculated premium monthly average LME spec BS EN 11792003    "]
["MB-FEC-0011",1409,42260,"FCR-MBCNICSH-MB","FCR CN imp chrg 50% Cr Idx CIF  ","MB Ferro Chrome China import charge chrome 50 percent  Cr index CIF Shanghai    "]
["MB-PB-0067",1696,42264,"PB-LMPMTDT-MB","Lead LME prompt date            ","Lead Prompt Date Dec 1 LME Daily Official $ per tonne                           "]
["MB-AL-0263",1660,42267,"AL-MBA3SHLMY-MB","The record could not be found","The record could not be found"]
["MB-AL-0262",1659,42268,"AL-MBA3SHLM-MB","The record could not be found","The record could not be found"]
["MB-AL-0261",1658,42269,"AL-MBACSHLMY-MB","The record could not be found","The record could not be found"]
["MB-AL-0260",1657,42270,"AL-MBACSHLMU-MB","The record could not be found","The record could not be found"]
["MB-CU-0345",1662,42271,"CU-MBACSHLMY-MB","The record could not be found","The record could not be found"]
["MB-CU-0344",1661,42272,"CU-MBACSHLMU-MB","The record could not be found","The record could not be found"]
["MB-CU-0347",1664,42273,"CU-MBA3SHLMY-MB","The record could not be found","The record could not be found"]
["MB-CU-0346",1663,42274,"CU-MBA3SHLMU-MB","The record could not be found","The record could not be found"]
["MB-ZN-0075",1666,42275,"ZN-ARCSHLM-MB","The record could not be found","The record could not be found"]
["MB-ZN-0074",1665,42276,"ZN-MBACSHLMU-MB","The record could not be found","The record could not be found"]
["MB-ZN-0077",1668,42277,"ZN-MBA3SHLMY-MB","The record could not be found","The record could not be found"]
["MB-ZN-0076",1667,42278,"ZN-MBA3SHLMU-MB","The record could not be found","The record could not be found"]
["","",42280,"GA-MBFMKTMV-MB","Mtl Bulletin Gallium FrMrkt MAv ","Metal Bulletin Gallium free market monthly average                              "]
["MB-AL-0343",2641,42281,"AL-MBJIGLHLM-MB","\"Al P1020A,cif Japan prt,spt LH\"","Aluminium P1020A, cif main Japanese ports, spot low-high, $/tonne               "]
["MB-AL-0226",1208,42282,"AL-MBJIGPLM-MB","\"Al P1020A,cif Japan pt,spt wtav","Aluminium P1020A, cif main Japanese ports, spot weighted average, $/tonne       "]
["MB-MNO-0001",1410,42285,"MN-MBOPRTIC-MB","MB MNOre 44  Mn Cif Tianjin     ","Metal Bulletin Manganese Ore 44  Mn Cif Tianjin USD per dry metric tonne unit   "]
["MB-MNO-0002",1411,42286,"MN-MBOPRELF-MB","MB MN Ore 38 Mn Fob PrtElizabeth","Metal Bulletin Manganese Ore 38 Mn Fob Port Elizabeth USD dry metric tonne unit "]
["","",42287,"CO-MBLMSTWO-MB","NF CO Wld m99.3% Ofc LME Dly Stl","Cobalt Metal min 99.3% settlement LME $ per tonne                               "]
["MB-AL-0258",1645,42291,"AL-MBLMC3SP-MB","Al Cash to LME 3Mnt Close sprd  ","LME Aluminium cash-to-three month closing spread $ per tonne                    "]
["MB-CU-0340",1644,42292,"CU-MBLMC3SP-MB","Cu cash to LME 3Mnt cls sprd    ","LME Copper cash-to-three month closing spread $ per tonne                       "]
["MB-STE-0093",203,42296,"ST-TRDABSC-MB","Steel TR dm auto bundle Scp del ","Steel Turkey domestic auto bundle scrap Turkish lira per tonne delivered        "]
["MB-STE-0094",204,42297,"ST-TRDMLSCD-MB","Steel TR dm melting Scp shpbrkng","Steel Turkey domestic melting scrap from shipbreaking $ per tonne delivered     "]
["MB-STE-0123",234,42298,"ST-UAEIHDGC-MB","UAE import HtDpGalvC cfr JebelAl","UAE import hot dip-galvanized coil $ per tonne cfr Jebel Ali                    "]
["MB-STE-0033",69,42299,"ST-EUDNSECE-MB","EU domstc NthRgn hlw section exw","EU domestic Northern Region hollow sections Ç per tonne ex-works                "]
["MB-STE-0041",77,42300,"ST-EUDSSECE-MB","EU domstc SthRgn hlw section exw","EU domestic Southern Region hollow sections Ç per tonne ex-works                "]
["MB-IRO-0012",444,42301,"FE-PLIDCQ-MB","IronOre Pellet Idx cfr Qin.65%Fe","Iron Ore Pellet Index cfr Qingdao (65% Fe) $ per dry metric tonne weekly index  "]
["MB-IRO-0013",445,42302,"FE-COIDCQ-MB","IronOre Con.Idx(66% Fe) cfr Qin.","Iron Ore Concentrate Index(66% Fe) cfr Qingdao $/dry metric tonne weekly index  "]
["MB-STE-0107",217,42303,"ST-TREHRCPF-MB","Turkey export HRC fob main ports","Turkey export hot rolled coil $ per tonne fob main port                         "]
["MB-STE-0111",221,42304,"ST-TRDPGVSE-MB","TR domestic prepaintGalvS ex wor","Turkey domestic prepainted galvanized steel $ per tonne ex works                "]
["MB-STE-0101",211,42305,"ST-SAMPLTIC-MB","Sth AM import Plate cfr main prt","South America plate import $ per tonne cfr main ports                           "]
["MB-STE-0102",212,42306,"ST-SAMHRCIC-MB","Sth Am import HRC cfr main port ","South America import hot rolled coil $ per tonne cfr main ports                 "]
["MB-STE-0103",213,42307,"ST-SAMCRCIC-MB","Sth AM import CRC cfr main port ","South America import cold rolled coil $ per tonne cfr main ports                "]
["MB-STE-0104",214,42308,"ST-SAMHDGIC-MB","Sth AM import HtDpGalvC cfr m pt","South America import hot dip galvanized coil $ per tonne cfr main ports         "]
["MB-STE-0438",1428,42309,"ST-INDMREBE-MB","India domestic rebar ex works   ","India domestic rebar rupees per tonne ex works                                  "]
["MB-IRO-0018",1392,42310,"FE-MBIUSFN-MB","Steel MB US Fe IO Fines cfr Qin ","Metal Bulletin Indicator for US$/% Fe in Iron Ore Fines cfr Qingdao             "]
["MB-STE-0454",1461,42384,"ST-IRIHRCPC-MB","Iran Import HRC cfr IR ports    ","Iran import hot rolled coil $ per tonne cfr Iranian ports                       "]
["MB-STE-0453",1460,42385,"ST-IRICRCPC-MB","Iran Import CRC cfr Iranian port","Iran import cold rolled coil $ per tonne cfr Iranian ports                      "]
["MB-STE-0451",1458,42386,"ST-IRIHDGPC-MB","Iran import HtDpGalvC cfr IR prt","Iran import hot-dip galvanized coil $ per tonne cfr Iranian ports               "]
["MB-STE-0456",1463,42387,"ST-IRIPLTPC-MB","Iran import plate cfr IR ports  ","Iran import plate $ per tonne cfr Iranian ports                                 "]
["","",42388,"ST-IRDUBMES-MB","The record could not be found","The record could not be found"]
["MB-STE-0448",1455,42389,"ST-IRDBLTES-MB","Iran domestic billet ex Stock   ","Iran domestic billet million rials per tonne ex stock Tehran                    "]
["MB-PB-0061",1623,42390,"PB-MBSEBTPMR-MB","Soft Pb EU Ind batry Prm Rdm    ","Metal Bulletin Soft lead  European Industrial battery premium  Rotterdam        "]
["MB-PB-0063",1625,42391,"PB-EIBTPMRW-MB","EU Ind battry prem whs Rdm FrMkt","EU Ind. batery prem in warehous RDM FreeMrkt(Eurobat) Traction refined/soft lead"]
["MB-STE-0449",1456,42392,"ST-IRIPGASPC-MB","Iran Import PrePaintGavlS cfr IR","Iran import prepainted galvanized steel $ per tonne cfr Iranian ports           "]
["MB-STS-0002",59,42393,"ST-EUDCRSHB-MB","EU dom 316 CRStlnlsShtAly BasPrc","EU domestic 316 2mm cold rolled stainless sheet base price delivered Ç pertonne "]
["MB-STS-0001",58,42394,"ST-EUDCRSHA-MB","EU dom 316 CRStlnlsShtAly Srchrg","EU domestic 316 2mm cold rolled SS alloy surcharge delivered Ç per tonne        "]
["","",42395,"ST-MBCKCPJIC-MB","The record could not be found","The record could not be found"]
["","",42396,"ST-MBCKCMJIC-MB","The record could not be found","The record could not be found"]
["","",42397,"AL-MBINAUFMA-MB","Al Index fob Australia MAvg     ","Metal Bulletin Non-Ferrous Metals Alumina Index fob Australia Monthly Average   "]
["","",42398,"MO-MBLMSTLDO-MB","MO Metal Stl. Dly Ofc LME       ","Molybdenum Metal Settlement Official London Metal Exchange daily price$ /tonne  "]
["MB-COA-0001",296,42399,"ST-CNCCDS-MB","CN HrdCokCoal Shanxi mkt dom del","China Hard Coking Coal Shanxi spot market domestic delivered Yuan per tonne     "]
["MB-STE-0157",284,42400,"ST-NCNTADBLT-MB","China Nth Domestc Billet ex-work","Northern China Tangshan Domestic Billet ex-works Yuan per tonne                 "]
["MB-STE-0162",292,42401,"ST-NCNTADREB-MB","China Nth domestic Rebar ex-ware","Northern China Domestic Rebar ex-warehouse Yuan per tonne                       "]
["MB-STE-0158",285,42402,"ST-HRCDNCD-MB","CN Northern domestic HRC ex ware","Northern China Domestic Hot Rolled Coil ex-warehouse Yuan per tonne             "]
["MB-STE-0092",202,42403,"ST-PLDREBE-MB","Poland domestic rebar ex-works  ","Poland domestic rebar ex-works zloty per tonne                                  "]
["MB-STE-0008",35,42405,"ST-BRREBD-MB","Brazil domestic rebar delvrd mnt","Brazil domestic rebar delivered Reais per tonne monthly                         "]
["MB-STE-0007",34,42406,"ST-BRHRCE-MB","Brazil domestic HRC exw mntly   ","Brazil domestic hot rolled coil ex-works Reais per tonne monthly                "]
["MB-STE-0005",32,42407,"ST-BRCRCE-MB","BR domestic CRC ex works monthly","Brazil domestic cold rolled coil ex-works Reais per tonne monthly               "]
["MB-STE-0006",33,42408,"ST-BRHDGE-MB","Brazil domestc HtDpGalvC exw mnt","Brazil domestic hot dipped galvanized coil ex-works Reais per tonne monthly     "]
["MB-ZN-0082",1780,42409,"ZN-MBSHGDEW-MB","Zinc UK Spl High grd deliv      ","Metal Bulletin Zinc UK Special High Grade delivered customer works basis        "]
["MB-CU-0005",406,42410,"CU-MBPJOHL-MB","\"Cu Johor low-high prm, GrdA Cth","\"Johor, Copper low-high premium, Grade A, cathode in warehouse, $ per tonne\"    "]
["MB-CU-0005",406,42411,"CU-MBPJOCL-MB","Cu Johor average prm GrdA Cthd  ","\"Johor, Copper average premium, Grade A, cathode, in warehouse $ per tonne\"     "]
["MB-STE-0140",264,42412,"ST-SEAISLBC-MB","SthEst /Est Asia import slab cfr","South East Asia/East Asia import slab $ per tonne cfr                           "]
["MB-STE-0141",265,42413,"ST-SEAIBLTC-MB","SthEst Asia Import Billet cfr   ","South East Asia Import Billet $ per tonne cfr                                   "]
["MB-STE-0139",263,42414,"ST-SEAIHRCC-MB","Sth East AS import HRC cfrVietn.","South East Asia Import Hot rolled coil $ per tonne cfr (Vietnam)                "]
["MB-STE-0138",262,42415,"ST-SEAICRCC-MB","Sth East AS import CRC cfr      ","South East Asia Import Cold rolled coil $ per tonne cfr                         "]
["MB-STE-0137",261,42416,"ST-SEAIHDGC-MB","SthEst AS import HtDpGalvC cfr  ","South East Asia Import Hot-dipped galvanized $ per tonne cfr                    "]
["MB-STE-0142",266,42417,"ST-SEAIREBC-MB","SthEst Asia Import Rebar cfr Sgp","South East Asia Import Rebar $ per tonne cfr (Singapore)                        "]
["MB-STE-0143",267,42418,"ST-SEAIWRDC-MB","SthEst AS Imp Wirerod lwcarb cfr","South East Asia Import Wire rod (low carbon) $ per tonne cfr                    "]
["MB-STE-0114",224,42419,"ST-SAIREBC-MB","Saudi Arabia import rebar cfr   ","Saudi Arabia import rebar $ per tonne cfr                                       "]
["MB-STE-0113",223,42420,"ST-SAIHRCC-MB","Saudi Import HRC cfr            ","Saudi Arabia import hot rolled coil $ per tonne cfr                             "]
["MB-STE-0136",247,42421,"ST-PRDREBE-MB","Peru domestic rebar ex-works mnt","Peru domestic rebar ex-works Peruvian Nuevos Soles pertonne monthly assessment  "]
["MB-STE-0004",28,42422,"ST-ARREBD-MB","The record could not be found","The record could not be found"]
["MB-STE-0003",27,42423,"ST-ARHRCE-MB","Argentina domestic HRC exw mntly","Argentina domestic hot rolled coil ex-works $ per tonne monthly assessment      "]
["MB-STE-0001",25,42424,"ST-AGCRCDE-MB","AR domestic CRC ex works        ","Argentina domestic cold rolled coil ex-works $ per tonne monthly assessment     "]
["MB-STE-0002",26,42425,"ST-ARHDGCE-MB","AR domestic HtDpGalvC exw mntly ","Argentina domestic hot dipped galvanized coil ex-works $ per tonne monthly      "]
["MB-STS-0024",377,42426,"ST-US1SCPLTF-MB","US 304 StnlsSht CldPalte fob mil","USA grade 304SS coiled plate $ per hundredweight fob mill monthly assessment    "]
["MB-STS-0026",379,42427,"ST-US2SCPLTF-MB","US 316 StnlsSht CldPalte fob mil","USA grade 316 SS coiled plate $/hundredweight fob mill monthly assessment       "]
["MB-STS-0035",388,42428,"ST-US1SCRSF-MB","US 304 StnlsSht CRC fob mill    ","USA grade 304 SS cold rolled sheet $/hundredweight fob mill monthly assessment  "]
["MB-STS-0037",390,42429,"ST-US2SCRSF-MB","USA grd 316L SSteel CRS fob mill","USA grade 316L SS cold rolled sheet $/hundredweight fob mill monthly assessment "]
["MB-STE-0019",53,42430,"ST-USDLNPF-MB","US domestic ERW linpipe fob mill","USA domestic ERW linepipe (X42) $ per short ton fob mill monthly assessment     "]
["MB-STE-0055",130,42431,"ST-USDLNPC-MB","US import ERW linepipe crf      ","USA import ERW linepipe (X42) c&f $ per short ton monthly assessment            "]
["MB-STE-0058",133,42432,"ST-USIOCSC-MB","US import OCTG API5CT crf del   ","USA import OCTG API5CT - casing J/K55 c&f $/ton delivered monthly assessment    "]
["MB-STE-0063",152,42433,"ST-USIOCSF-MB","US OCTG API5CT fob mill         ","USA OCTG API5CT - casing J/K55 $ per short ton fob mill monthly assessment      "]
["MB-STE-0066",155,42434,"ST-MBRDRBCP-MB","Russian domstc rebar cpt inc VAT","Russian domestic rebar rubles per tonne carriage paid (cpt) inc VAT             "]
["MB-STE-0065",154,42435,"ST-MBCDHRCP-MB","Russian domestic HRC cpt inc VAT","Russian domestic hot rolled sheet rubles per tonne carriage paid (cpt) inc VAT  "]
["MB-STE-0064",153,42436,"ST-MBDCRCP-MB","Russian domestic CRC cpt inc VAT","Russian domestic Cold rolled sheet rubles per tonne carriage paid(cpt) inc VAT  "]
["MB-STE-0424",1404,42437,"ST-MBSCIHMMD-MB","MB Scp Idx No1 hv mltng Scp Mdws","Metal Bulletin Scrap Indices No1 heavy melting scrap Midwest Index              "]
["MB-STE-0422",1402,42438,"ST-INBUDMA-MB","ScpIdx N1bush. US dm Idx MntAsmt","Scrap Indices No1 busheling US domesticMidwestIndex $/gross tonMonthlyAssessment"]
["MB-STE-0423",1403,42439,"ST-MBSCISHMD-MB","MB Scp Indices Shredded Midwest ","Metal Bulletin Scrap Indices Shredded Midwest Index                             "]
["MB-STE-0182",325,42440,"ST-MBUSIMHD-MB","USA import HtDpGalvC G30 cif    ","USA import hot-dipped galvanized 0.012-0.015 G30 cif Houston $ per short ton    "]
["MB-STE-0183",326,42441,"ST-USIHDGHC-MB","USA import HtDpGalvC G60 cif    ","USA import hot-dipped galvanized 0.019 G60 cif Houston $ per short ton          "]
["MB-STE-0110",220,42442,"ST-TRDHDGE-MB","Turkey domestic HtDpGalvC exwork","Turkey domestic hot dip galvanized $ per tonne ex-works                         "]
["MB-STE-0200",429,42443,"ST-USDMBRF-MB","USA domestic MerchntBar fob mill","USA domestic merchant bar 3 x 3 1/4 angle $ per hundredweight fob mill          "]
["MB-COA-0005",1387,42444,"ST-CNPMCCIJC-MB","MB SF CkCoal Idx-PrmHrdCC C Jing","MB Steel First Coking Coal Index-Premium Hard Coking Coal $/tonne CFR Jingtang  "]
["MB-COA-0002",1384,42445,"ST-CNCCIJC-MB","MB SF CkCoal Idx-Hrd CC CFR Jing","MB Steel First Coking Coal Index - Hard Coking Coal $ per tonne CFR Jingtang    "]
["MB-COA-0003",1385,42446,"ST-CNPMCCIDF-MB","MB SF CkCoal Idx-PrmHrdCC F DBCT","MB Steel First Coking Coal Index - Premium Hard Coking Coal $ pertonne FOB DBCT "]
["MB-COA-0004",1386,42447,"ST-CNCCIDF-MB","MB SF CkCoal Idx-Hrd CC FOB DBCT","MB Steel First Coking Coal Index - Hard Coking Coal $ per tonne FOB DBCT        "]
["MB-STE-0418",1398,42457,"ST-MBEXIFNY-MB","MB  AMM F Scp Exp Idx HMS fob NY","Metal Bulletin  AMM Ferrous Scrap Export Index  HMS 1&2 East Coast fob New Yor  "]
["MB-STE-0419",1399,42458,"ST-MBFSEXNYF-MB","MB AMM FScp Exp Idx Shrd EastCst","Metal Bulletin AMM Ferrous Scrap Export Index Shredded East Coast fob New York  "]
["MB-CU-0336",1626,42459,"CU-MBAEUGACT-MB","Cu Aurubis EU grdA cathode      ","Metal Bulletin Non-Ferrous Metals Copper Aurubis European Grade A cathode       "]
["MB-CO-0004",1070,42460,"CO-MBFMKHGR-MB","MB NF Co Mtl MB FrMrkt High grd ","Metal Bulletin Non-Ferrous Metals Cobalt Metal MB free market High grade        "]
["MB-CO-0005",1071,42461,"CO-MBFMWATR-MB","NF Mtl Co MB FrMrkt L gd WAv whs","NnFrsMtlCobaltMtlMBFreeMrktLowGradeWeigtdAvgofallCnfrmdIntlTrdes$/Ibinwarehouse "]
["MB-STS-0137",1388,42462,"ST-EUDSINE-MB","EU dom 304 StnlSht EU RwMtrl Idx","EU domestic Stainless Steel 304 Raw Materials Index $954.20 per tonne ex works  "]
["MB-STE-0126",237,42467,"ST-UAEDREBE-MB","UAE domestic rebar ex works     ","UAE domestic rebar UAE dirhams per tonne exw                                    "]
["MB-CO-0007",1073,42468,"CO-MBFMKIGW-MB","MB NF CO FrMrkt Ing K1A K1AY whs","MB Non-Ferrous Cobalt free market Ingots including K1A and K1AY In warehouse    "]
["MB-CO-0009",1075,42469,"CO-MBFMKIG-MB","MB NF CO FrMrkt Ing             ","MB Non-Ferrous Cobalt free market Ingots USD per pound                          "]
["MB-CO-0010",1076,42470,"CO-FMKBCTPD-MB","NF MB/LME Pr disc CO FrMk BCathd","Non-Ferrous MB/LME premium discount Cobalt free market Broken cathodes          "]
["MB-CO-0006",1072,42471,"CO-FMBCLPD-MB","Co FrMrkt BCthd Brq MB LME P Dsc","CobaltFreMrktBrknCathdBriquttMBLMEPrmDscntIncldgChmbshTcntsCTTAmbtvICCMrnMrn$/Ib"]
["MB-CO-0008",1074,42472,"CO-FMCCLPDWR-MB","Co FrMrkt CtCthd Rd MB LME P Dsc","CobaltFreMrktCutCthdRdMBLMEPrDscIncldFnbdgVlIcStmMtlMngJngKLKJchnInWrhseRtrdm$/t"]
["MB-CO-0011",1077,42473,"CO-MBFMKCCT-MB","MB NF Co FrMrkt Cut cathd/rounds","Metal Bulletin Non-Ferrous Metals Cobalt free market Cut cathodes/rounds        "]
["MB-FEN-0002",298,42474,"NI-MBPIHGSDP-MB","MB NPI H Grd NPI 10-15% spt DtPd","MB Nickel pig iron High grade NPI content 10-15% spot price delivered duty paid "]
["MB-FEN-0001",297,42475,"NI-MBPIHGC-MB","MB NPI H Grd NPI 10-15% Cont prc","MB Nickel pig iron High grade NPI content 10-15% Contract price                 "]
["MB-AL-0021",252,42476,"AL-MBBRPM-MB","\"Al P1020A,del SaoPaulo regn,spt","Aluminium P1020A, delivered Sao Paulo region, spot, $/tonne                     "]
["MB-CU-0287",1406,42477,"CU-MBCNASPI-MB","Cu Concent. Asia-Pacific import ","Metal Bulletin Copper Concentrate Asia-Pacific  import $ per dmt                "]
["MB-CU-0288",1407,42478,"CU-MBCPBBM-MB","Cu CoPublished twice Mntly      ","Metal Bulletin Copper CoPublished twice monthly US cents per pound              "]
["MB-NIO-0001",299,42479,"NI-ORBCNC-MB","Ni Ore 1.8% bs cif CN 15-20%Fe  ","Metal Bulletin Nickel ore 1.8% basis cif China 15-20 percent Fe Water content   "]
["MB-STE-0025",61,42480,"ST-EUDBSTE-MB","EU domestic beams del Sth EU    ","EU domestic beams Ç per tonne del Southern Europe                               "]
["MB-STE-0024",60,42481,"ST-EUDBNTE-MB","EU domestic beams del Nth EU    ","EU domestic beams Ç per tonne del Northern Europe                               "]
["MB-STE-0032",68,42482,"ST-EUDBENTE-MB","EU domestic beams ex-work Nth EU","EU domestic beams Ç per tonne ex-works Northern Europe                          "]
["MB-STE-0040",76,42483,"ST-EUDBESTE-MB","EU domestic beams ex-work Sth EU","EU domestic beams Ç per tonne ex-works Southern Europe                          "]
["MB-STE-0166",300,42484,"ST-TRDSPF-MB","TR Exp S235JR EN10219 struc.pipe","TR exprt S235JR grd EN10219 2mm wall thickness structural pipe $/t fob mainport "]
["MB-STE-0169",303,42485,"ST-SCDEE3M-MB","DE dom. No E3 scrap del DE mill ","Germany domestic No E3 scrap Ç per tonne delivered to German mill               "]
["MB-STE-0417",1397,42486,"SC-DFSCIND-MB","MB FrsScrp Idx HMS 1&2(80:20 mix","Daily MB Ferrous scrap Index HMS 1&2 (80:20 mix) (USA material) cfr Turkey      "]
["MB-STE-0470",1536,42529,"ST-AMUSDHGM-MB","USA AMM domestic HtDpGalv bsPrc ","AMM USA dom Hot-dipped galvanized(base)price $/ton Midwest markt price fob mill "]
["MB-STE-0167",301,42531,"ST-ITDOTSC-MB","IT dom. No E3 (old thick scrap) ","Italy domestic No E3 (old thick scrap) Ç per tonne del mill                     "]
["MB-STE-0168",302,42532,"ST-ITDNWPR-MB","IT dom. No E8 (thin new prd Stl)","Italy domestic No E8 (thin new production steel) Ç per tonne del mill           "]
["MB-AL-0022",305,42550,"AL-SPBZDUP-MB","Al P1020A,cif main Brazil prt,qt","Aluminium P1020A, cif main Brazil ports, quarterly, $/tonne                     "]
["","",42574,"ZN-LMESTLLHO-MB","Zinc Stl. LME Ofc L/H Jan CMtCm ","LME Zinc Settlement Official L/H Jan - current month (cumulative) $ per tonne   "]
["","",42578,"CU-LMOHLJCM-MB","Cu 3Mnt LME Ofc L/H Jan CurMt Cm","LME Copper 3 M seller Official L/H Jan - current month (cumulative) $ per tonne "]
["","",42579,"CU-LMSHLJCM-MB","Cu Stl. LME Ofc L/H Jan CurMt Cm","LME Copper Settlement Official L/H Jan - current month (cumulative) $ per tonne "]
["","",42580,"PB-LM3MOHL-MB","Lead 3Mnt LME Ofc L/H Jan CMt Cm","LME Lead 3 months Official L/H Jan - current month (cumulative) $ per tonne     "]
["","",42581,"PB-LMSTLOHL-MB","Lead Stl. LME Ofc L/H Jan CMt Cm","LME Lead Settlement Official L/H Jan - current month (cumulative) $ per tonne   "]
["","",42589,"ST-CNHRCPC-MB","The record could not be found","The record could not be found"]
["","",42595,"ST-TREMBRF-MB","The record could not be found","The record could not be found"]
["","",42597,"AL-SPJPDUPMA-MB","The record could not be found","The record could not be found"]
["","",42641,"ST-CISESECB-MB","The record could not be found","The record could not be found"]
["","",42778,"SN-WLFMSMA-MA","The record could not be found","The record could not be found"]
["","",42779,"SN-WLKLSMA-MA","The record could not be found","The record could not be found"]
["","",42780,"CU-UKPBXMA-MB","The record could not be found","The record could not be found"]
["","",42781,"ZN-SCFIAUMA-MB","The record could not be found","The record could not be found"]
["","",42783,"SN-WLFMSPMA-MB","The record could not be found","The record could not be found"]
["","",42788,"MG-WLFMMA-MB","The record could not be found","The record could not be found"]
["","",42792,"CU-HUSCTMA-MB","The record could not be found","The record could not be found"]
["","",42793,"SI-NFHKAV-MB","HK Avg NonFerrous Metals Silicon","Silicon min 98.5% Hong Kong fob main Chinese ports $ per tonne Monthly average  "]
["","",42794,"ALA-LMCSHL-MB","The record could not be found","The record could not be found"]
["","",42795,"ALA-LM3MHL-MB","The record could not be found","The record could not be found"]
["","",42796,"ALA-LMSTLHL-MB","The record could not be found","The record could not be found"]
["","",42797,"ALA-LM3SLRHL-MB","The record could not be found","The record could not be found"]
["","",42882,"NI-UNCTFMKP-MB","Nickel Uncut cthd FrMrkt whs prm","Uncut cathodes Non-Ferrous NI Metal Free Mkt in wrehouse prem Eu Melting $/tonne"]
["","",42883,"NI-FOURFMKP-MB","Nickel 4x4cthd FrMrkt in whs prm","4x4 cathodes Non-Ferrous NI Metal Free Mkt in wrehouse prem Eu Melting $/tonne  "]
["","",42884,"NI-BRIQFMKP-MB","Ni Briq. cthd FrMrkt in whs prem","Briquettes Non-Ferrous NI Metal Free Mkt in wrehouse prem Eu Melting $/tonne    "]
["MB-IRO-0015",1389,42994,"FE-IOCQIND-MB","MB 58% Fe IO Indx CFR Qin.      ","MB 58% Fe IO Indx (MBIOI-58) CFR Qingdao 58%fe basis Dly Prc $ per dry mt tonne "]
["MB-IRO-0016",1390,42995,"FE-HGPCQ-MB","CFR Qin.on a 58% bs low Al low P","High grade Prm(MBIOI-58P)CFR Qingdao 58%low alumina,low phosp $/DMT             "]
["","",42996,"CO-MBFMKHGL-MB","MB NF Co FrMrkt High grd Low Prc","Metal Bulletin Non Ferrous Metals Cobalt Free Market High Grade Low Price       "]
["","",42997,"CO-MBFMKHGH-MB","MB NF Co FrMrkt High Gr High Prc","Metal Bulletin Non Ferrous Metals Cobalt Free Market High Grade High Price      "]
["","",42998,"CO-MBFMKHGMA-MB","MB NF Co Market High grd MeanAvg","Metal Bulletin Non Ferrous Metals Cobalt Metal Market High Grade Mean average   "]
["","",42999,"CO-MBFMKLGL-MB","MB NF Co Market Low grd Low Prc ","Metal Bulletin Non Ferrous Metals Cobalt Metal Market Low Grade Low Price       "]
["","",43000,"CO-MBFMKLGH-MB","MB NF Co FrMrkt Low grd High Prc","Metal Bulletin Non Ferrous Metals Cobalt Free Market Low Grade High Price       "]
["","",43001,"CO-MBFMKLGMA-MB","MB NF Co FrMrkt Low grd Mean Avg","Metal Bulletin Non Ferrous Metals Cobalt Free Market Low Grade Mean Average     "]
["","",43002,"CO-MBHGRLMA-MB","Mb Co High grd Low price Mav    ","MB Cobalt High Grade Low price Monthly average $ per Ib                         "]
["","",43004,"CO-MBHGRHMA-MB","Mb Co High grd High price Mav   ","MB Cobalt High Grade High price Monthly average $ per Ib                        "]
["","",43005,"CO-MBHGRMMA-MB","Mb Co High grd Mean MAv $ per Ib","MB Cobalt High Grade Mean Monthly average $ per Ib                              "]
["","",43006,"CO-MBLGRLMA-MB","Mb Co Low grd Low price Mav     ","MB Cobalt Low Grade Low price Monthly average $ per Ib                          "]
["","",43007,"CO-MBLGRHMA-MB","Mb Co Low grd High price Mav    ","MB Cobalt Low Grade High price Monthly average $ per Ib                         "]
["","",43008,"CO-MBLGRMMA-MB","Mb Co Low grd Mean MAv $ per Ib ","MB Cobalt Low Grade Mean Monthly average $ per Ib                               "]
["","",43009,"FSC-MBINCTR-MB","The record could not be found","The record could not be found"]
["","",43010,"ZN-MBSHLHLMA-MB","Zn SH LH MA LME BSEN11792003    ","MB Zn prem SH primary Zn to meet LME spec: BS EN 1179:2003 L-H MA $/tonne       "]
["MB-IRO-0010",426,43048,"FE-LMPQIND-MB","MB Lump Prm CFR Qin. Indx       ","Metal Bulletins lump premium CFR Qingdao (MBIOI-LP Index) cents per dmtu daily  "]
["MB-IRO-0009",425,43049,"FE-IOBRIND-MB","MB 65%Fe BRIndex CFR Qin. Indx  ","MB 65% Fe Brazilian Index CFR Qingdao (MBIOI-65-BZ-Index) $/tonne               "]
["MB-IRO-0020",1394,43050,"FE-MBIUSFNM-MB","MB Ind. for US$/% SiVIU cfr Qin.","Metal Bulletin Indicator for US$/% Si MBIOI Si-VIUcfr Qingdao Monthly indicator "]
["","",43051,"AL-IGPMDUW-MB","The record could not be found","The record could not be found"]
["","",43060,"ST-SHFREB1S-MB","SteelFrst SHFE Rebar Mnt1 Settle","Shanghai Futures Exchange rebar yuan per tonne settlement Month 1               "]
["","",43061,"ST-SHFREB2S-MB","SteelFrst SHFE Rebar Mnt2 Settle","Shanghai Futures Exchange rebar yuan per tonne settlement Month 2               "]
["","",43062,"ST-SHFREB3S-MB","SteelFrst SHFE Rebar Mnt3 Settle","Shanghai Futures Exchange rebar yuan per tonne settlement Month 3               "]
["","",43063,"ST-SFSFREB-MB","For SteelFirst SHFE Rebar Wk Stk","\"Shanghai Futures Exchange rebar weekly inventories, tonnes\"                    "]
["MB-STE-0514",1778,43082,"ST-RUDSPLT-MB","RU DS Plate CPT inc VAT         ","Russian domestic plate rubles per tonne carriage paid (cpt) inc VAT             "]
["MB-STE-0516",1786,43083,"ST-EGIMBLT-MB","EG import billet cfr main port  ","Egypt import billet $ per tonne cfr main port                                   "]
["MB-COA-0006",1788,43084,"ST-SFCSRCK-MB","SF 65% CSR Coke FOB Tianjin     ","Steel First 65% CSR Coke $ per tonne FOB Tianjin                                "]
["MB-AL-0287",1841,43085,"AL-EBLTBZPT-MB","Al 6063 & 6060 ext blt, cif Brz ","Aluminium 6063 & 6060 extrusion billet, cif Brazilian main ports, spot $/tonne  "]
["MB-PB-0071",1843,43086,"PB-JHPRMPT-MB","Johor Pb Prm 99.97 in whs       ","Johor, lead premium, 99.97% purity, in warehouse, $ per tonne                   "]
["MB-PB-0071",1843,43087,"PB-JHLHPPT-MB","Johor Pb HLPrm 99.97 in whs     ","Johor, lead low-high premium, 99.97% purity, in warehouse, $ per tonne          "]
["MB-IRO-0024",1844,43088,"FE-MBIOFPH-MB","FE fines Phs-VIU MBIOI          ","FE Ore Fines 62%, 0.01% Phosphorous MBIOI Phs-VIU cfr Qingdao US cent per DMT   "]
["MB-NI-0101",1860,43092,"NI-MYBRIP-MB","Nickel Mtl 99.80 briqt Prm in Wh","Nickel 99.80% briquettes premium in-warehouse Malaysia $/tonne                  "]
["MB-NI-0100",1859,43093,"NI-SGBRIP-MB","Nickel Mtl 99.80 briqt Prm in Wh","Nickel 99.80% briquettes premium in-warehouse Singapore $/tonne                 "]
["MB-NI-0099",1858,43094,"NI-MYFPP-MB","Nickel Mtl 99.80 fplt Prm in Whs","Nickel 99.80% Full Plate premium in-warehouse Malaysia $/tonne                  "]
["MB-NI-0098",1857,43095,"NI-SGFPP-MB","Nickel Mtl 99.80 fplt Prm in Whs","Nickel 99.80% Full Plate premium in-warehouse Singapore $/tonne                 "]
["MB-STE-0517",1861,43096,"ST-ALGIMRB-MB","Alg import rebar cfr main port  ","Algeria import rebar â�⅛ per tonne cfr main port                                "]
["MB-IRO-0025",1975,43097,"FE-MBIFIDX-MB","MB IR Fines IDX cfr China       ","Metal Bulletin 60% Fe Iranian Fines Index (MBIOI-IR) CFR China US $ per tonne   "]
["MB-NI-0106",2014,43098,"NI-MBAIMPD-MB","Ni Arb Import USD               ","Metal Bulletin Nickel Arbitrage Import in USD per tonne                         "]
["MB-NI-0107",2015,43099,"NI-MBAIMPY-MB","Ni Arb Import Yuan              ","Metal Bulletin Nickel Arbitrage Import in Yuan per tonne                        "]
["MB-STE-0532",2003,43112,"ST-EUHRCE-MB","Central EU domestic HRC exw wkly","Central EU domestic hot rolled coil ex-works EUR per tonne weekly assessment    "]
["MB-AL-0288",2006,43116,"AL-EBLTJPPT-MB","Al Exrsn BltPrm 6063 in whs JP  ","Aluminium extrusion billet premium 6063 Cif Japan $ per tonne                   "]
["MB-AL-0289",2010,43118,"AL-MBAIMPD-MB","Al Arb Import USD               ","Metal Bulletin Aluminium Arbitrage Import in USD per tonne                      "]
["MB-AL-0290",2011,43119,"AL-MBAIMPY-MB","Al Arb Import Yuan              ","Metal Bulletin Aluminium Arbitrage Import in Yuan per tonne                     "]
["MB-CU-0361",2008,43120,"CU-MBAIMPD-MB","Cu Arb Import USD               ","Metal Bulletin Copper Arbitrage Import in USD per tonne                         "]
["MB-CU-0362",2009,43121,"CU-MBAIMPY-MB","Cu Arb Import Yuan              ","Metal Bulletin Copper Arbitrage Import in Yuan per tonne                        "]
["MB-ZN-0083",2012,43122,"ZN-MBAIMPD-MB","Zinc Arb Import USD             ","Metal Bulletin Zinc Arbitrage Import in USD per tonne                           "]
["MB-ZN-0084",2013,43123,"ZN-MBAIMPY-MB","Zinc Arb Import Yuan            ","Metal Bulletin Zinc Arbitrage Import in Yuan per tonne                          "]
["MB-NIO-0002",2027,43136,"NI-LATORCN-MB","Li Ore 1.5% Ni cif CN           ","Laterite ore with 1.5% nickel content cif China $ per tonne                     "]

{"sheet":"Bloomberg","index":10,"n_rows":2226,"n_cols":8,"rows_kept":2226,"cut":false,"hidden":true,"merged":[]}
["Package","Market ID","Symbol","Desc","Currency","Unit","Frequency","BB Ticker"]
["Base Metal",3586,"MB-AL-0355","Aluminum, P1020A cif premium, US cents per pound","US Cents","pound","weekly",0]
["Base Metal",3586,"MB-AL-0355","Aluminum, P1020A cif premium, US cents per pound","US Cents","pound","weekly",0]
["Base Metal",2578,"MB-FEN-0003","Ferro-nickel China premium, 26-32% nickel contained, cif China, $ per tonne","USD","tonne","monthly",0]
["Basemetals","1","MB-ALU-0001","Alumina, MB, China, metallurgical grade, delivered duty paid, RBM/tonne","RMB","tonne","weekly",0]
["Basemetals","1208","MB-AL-0226","Aluminium P1020A, cif main Japanese ports, spot, $ per tonne","USD","tonne","weekly",0]
["Basemetals","1406","MB-CU-0287","Metal Bulletin Copper Concentrates Index TC  $/tonne","USD","tonne","twice monthly",0]
["Basemetals","1407","MB-CU-0288","Metal Bulletin Copper Concentrates Index RC Cents/pound","US Cents","pound","twice monthly",0]
["Basemetals","1408","MB-ALU-0002","Alumina Index US $ per tonne FOB Australia","USD","tonne","weekly",0]
["Basemetals","146","MB-NI-0001","Nickel Metal Europe 4x4 cathodes premium indicator in warehouse Rotterdam $/tonne    ","USD","tonne","weekly",0]
["Basemetals","147","MB-NI-0002","Nickel Metal Europe briquettes premium indicator in warehouse Rotterdam $/tonne","USD","tonne","weekly",0]
["Basemetals","148","MB-NI-0003","Nickel Metal Europe uncut cathodes premium indicator in warehouse Rotterdam $/tonne","USD","tonne","weekly",0]
["Basemetals","1519","MB-AL-0231","Aluminum P1020 free market delivered Midwest cents/lb","US Cents","Pound","weekly",0]
["Basemetals","1520","MB-CU-0309","Copper Cathode Grade 1 free market delivered domestic US cents/lb","US Cents","Pound","weekly",0]
["Basemetals","1521","MB-PB-0056","Lead 99.97% purity free market delivered domestic US cents/lb","US Cents","Pound","weekly",0]
["Basemetals","1522","MB-NI-0089","Nickel melting material 99.8% purity free market delivered domestic US cents/lb","US Cents","Pound","weekly",0]
["Basemetals","1523","MB-NI-0090","Nickel plating material 99.8% purity free market delivered domestic US cents/lb","US Cents","Pound","weekly",0]
["Basemetals","1524","MB-ZN-0061","Special High Grade Zinc free market delivered domestic US cents/lb","US Cents","Pound","weekly",0]
["Basemetals","1525","MB-ZN-0062","Nos. 3 and 7 Zinc Die Casting Alloy delivered domestic US cents/lb","US Cents","Pound","daily",0]
["Basemetals","1526","MB-ZN-0063","No. 5 Zinc Die Casting Alloy delivered domestic US cents/lb","US Cents","Pound","daily",0]
["Basemetals","1527","MB-ZN-0064","No. 2 Zinc Die Casting Alloy delivered domestic US cents/lb","US Cents","Pound","daily",0]
["Basemetals","1528","MB-ZN-0065","No. 8 Zinc-aluminum Foundry Alloys delivered domestic US cents/lb","US Cents","Pound","daily",0]
["Basemetals","1529","MB-ZN-0066","No. 12 Zinc-aluminum foundry alloys delivered domestic US cents/lb","US Cents","Pound","daily",0]
["Basemetals","1530","MB-ZN-0067","No. 27 Zinc-aluminum foundry alloys delivered domestic US cents/lb","US Cents","Pound","daily",0]
["Basemetals","1545","MB-CU-0310","Copper Cathode, Grade 1 premium, Delivered Domestic US, US dollar per tonne","USD","tonne","weekly",0]
["Basemetals","1546","MB-PB-0057","Lead premium 99.97% purity, Delivered Domestic US, US dollar per pound","USD","pound","weekly",0]
["Basemetals","1551","MB-AL-0233","A380.1, Secondary Aluminum Alloy, delivered Midwest, US dollar per pound","USD","pound","twice weekly",0]
["Basemetals","1571","MB-AL-0251","Aluminium Bronze AB1 United Kingdom £ per tonne, ex-works","GBP","tonne","weekly",0]
["Basemetals","1587","MB-CU-0321","Copper Republican copper price for Palabora 7.90mm South Africa Rand per tonne","ZAR","tonne","monthly",0]
["Basemetals","1621","MB-PB-0059","Lead Metal Ca/Ca grid lead (average) euros per tonne Eurobat","EURO","tonne","twice monthly",0]
["Basemetals","1622","MB-PB-0060","Connector lead (average) € per tonne Eurobat","EURO","tonne","twice monthly",0]
["Basemetals","1624","MB-PB-0062","Soft lead (average) € per tonne Eurobat","EURO","tonne","twice monthly",0]
["Basemetals","1626","MB-CU-0336","Aurubis Copper Grade A cathode premium Europe ex-works $ per tonne","USD","tonne","yearly",0]
["Basemetals","1636","MB-AL-0256","Aluminium rand fixing price per tonne for LME trade","ZAR","tonne","daily",0]
["Basemetals","1637","MB-CU-0338","Copper rand fixing price per tonne for LME trade","ZAR","tonne","daily",0]
["Basemetals","1638","MB-PB-0064","Lead rand fixing price per tonne for LME trade","ZAR","tonne","daily",0]
["Basemetals","1639","MB-NI-0093","Nickel rand fixing price per tonne for LME trade","ZAR","tonne","daily",0]
["Basemetals","1640","MB-SN-0005","Tin rand fixing price per tonne for LME trade","ZAR","tonne","daily",0]
["Basemetals","1641","MB-ZN-0072","Zinc rand fixing price per tonne for LME trade","ZAR","tonne","daily",0]
["Basemetals","1716","MB-AL-0276","Aluminum alloy ingot A356.2 delivered $/lb","USD","pound","daily",0]
["Basemetals","1717","MB-AL-0277","Aluminum alloy ingot C355.2 delivered $/lb","USD","pound","daily",0]
["Basemetals","175","MB-SN-0001","Tin, 99.85%, spot premium, Europe,$ per tonne, in-warehouse Rotterdam","USD","tonne","weekly",0]
["Basemetals","176","MB-SN-0002","Tin, 99.9%, spot premium, Europe,$ per tonne, in-warehouse Rotterdam","USD","tonne","weekly",0]
["Basemetals","1780","MB-ZN-0082","Zinc MB UK delivered monthly average SHG price £ per tonne","GBP","tonne","monthly",0]
["Basemetals","1841","MB-AL-0287","Aluminium 6063 & 6060 extrusion billet, cif Brazilian main ports, spot (premium over LME cash), $/tonne","USD","tonne","monthly",0]
["Basemetals","1862","MB-SN-0011","Tin Grade A 99.85% premium delivered domestic US $ per tonne","USD","tonne","weekly",0]
["Basemetals","1863","MB-SN-0012","Tin Grade A 99.85% free market delivered domestic US $ per tonne","USD","tonne","weekly",0]
["Basemetals","2","MB-AL-0001","Aluminium P1020A, cif main Japanese ports, quarterly, $ per tonne","USD","tonne","quarterly",0]
["Basemetals","200","MB-ZN-0001","Zinc Metal MB EU Special High Grade, DP FCA Rotterdam $ per tonne","USD","tonne","weekly",0]
["Basemetals","2005","MB-ALU-0003","Alumina Index, fob Brazil, adjustment to fob Australia index $ per dry metric tonne","USD","dry metric tonne","twice weekly",0]
["Basemetals","2006","MB-AL-0288","Aluminium extrusion billet premium 6063 Cif Japan $ per tonne","USD","tonne","yearly",0]
["Basemetals","2008","MB-CU-0361","Copper import arbitrage $ per tonne","USD","tonne","daily",0]
["Basemetals","2009","MB-CU-0362","Copper import arbitrage yuan per tonne","RMB","tonne","daily",0]
["Basemetals","2010","MB-AL-0289","Aluminium import arbitrage $ per tonne","USD","tonne","daily",0]
["Basemetals","2011","MB-AL-0290","Aluminium import arbitrage yuan per tonne","RMB","tonne","daily",0]
["Basemetals","2012","MB-ZN-0083","Zinc import arbitrage $ per tonne","USD","tonne","daily",0]
["Basemetals","2013","MB-ZN-0084","Zinc import arbitrage yuan per tonne","RMB","tonne","daily",0]
["Basemetals","2014","MB-NI-0106","Nickel import arbitrage $ per tonne","USD","tonne","daily",0]
["Basemetals","2015","MB-NI-0107","Nickel import arbitrage yuan per tonne","RMB","tonne","daily",0]
["Basemetals","2027","MB-NIO-0002","Laterite ore with 1.5% nickel content cif China $ per tonne","USD","tonne","weekly",0]
["Basemetals","2053","MB-AL-0292","Aluminium ingot ADC 12 spot (MJP) $ per tonne","USD","tonne","weekly",0]
["Basemetals","2054","MB-AL-0293","Aluminium P1020A, in-warehouse Rotterdam duty-unpaid, spot, monthly average midpoint €/tonne","EURO","tonne","monthly",0]
["Basemetals","2055","MB-AL-0294","Aluminium P1020A, in-warehouse Rotterdam duty-paid, spot monthly average midpoint €/tonne","EURO","tonne","monthly",0]
["Basemetals","2089","MB-ALU-0010","Alumina Index, fob Brazil, inferred Brazil price $ per dry metric ton","USD","dry metric tonne","twice weekly",0]
["Basemetals","21","MB-AL-0020","Aluminum P1020 premium delivered Midwest cents/lb","US Cents","Pound","weekly",0]
["Basemetals","2217","MB-AL-0296","Aluminium billet, CIF Turkey (Marmara region) duty-paid,  over LME cash pay $/gross tonne","USD","gross tonne","monthly",0]
["Basemetals","2218","MB-AL-0297","Aluminium billet, CIF  Thailand duty-unpaid over LME cash pay $/gross tonne","USD","gross tonne","monthly",0]
["Basemetals","2220","MB-AL-0299","Aluminium billet, delivered duty-paid Spain over LME 60-day pay $/gross tonne","USD","gross tonne","monthly",0]
["Basemetals","2221","MB-AL-0300","Aluminium billet,  delivered duty-paid Italy (Brescia area) over LME 60-day pay $/gross tonne","USD","gross tonne","monthly",0]
["Basemetals","2223","MB-AL-0302","Aluminium billet, delivered duty-paid North Germany (Ruhr region) over LME 30-day pay $/gross tonne","USD","gross tonne","twice monthly",0]
["Basemetals","2258","MB-SN-0029","Tin 99.9% Low Lead spot Ingots Premium  in-warehouse Rotterdam $/tonne","USD","tonne","weekly",0]
["Basemetals","2259","MB-SN-0030","Tin 99.85% Ingots  spot premium  CIF Shanghai $/tonne","USD","tonne","weekly",0]
["Basemetals","2260","MB-SN-0031","Tin 99.9% Low Lead Ingots  spot premium  CIF Shanghai $/tonne","USD","tonne","weekly",0]
["Basemetals","2261","MB-SN-0032","Tin 99.9% Ingots  spot premium  CIF Shanghai $/tonne","USD","tonne","weekly",0]
["Basemetals","2262","MB-SN-0033","Tin 99.9% Ingots  spot premium  in-warehouse Singapore $/tonne","USD","tonne","weekly",0]
["Basemetals","2264","MB-SN-0035","Tin 99.9% Low Lead Ingots  spot premium  in-warehouse Singapre $/tonne","USD","tonne","weekly",0]
["Basemetals","2265","MB-SN-0036","Tin 99.85% Ingots  spot premium  in-warehouse Baltimore $/tonne","USD","tonne","weekly",0]
["Basemetals","2267","MB-SN-0038","Tin 99.9% Ingots spot premium  CIF Taiwan $/tonne","USD","tonne","weekly",0]
["Basemetals","2282","MB-ZN-0093","Zinc premium, 99.995% purity, Southeast Asia, CIF, $ per tonne","USD","tonne","weekly",0]
["Basemetals","2283","MB-ZN-0094","Zinc premium, 99.995% purity, India, CIF duty-unpaid, $ per tonne","USD","tonne","weekly",0]
["Basemetals","2284","MB-ZN-0095","Zinc premium, 99.995% purity, India, CIF duty-paid, $ per tonne","USD","tonne","weekly",0]
["Basemetals","2287","MB-ZN-0098","Zinc EU special high grade, DUP FCA Rotterdam $/tonne","USD","tonne","weekly",0]
["Basemetals","2288","MB-ZN-0099","Zinc premium, 99.995% purity, Antwerp, duty paid FCA, $ per tonne","USD","tonne","weekly",0]
["Basemetals","2290","MB-ZN-0101","Zinc premium, 99.995% purity, Antwerp, duty-unpaid FCA $ per tonne","USD","tonne","weekly",0]
["Basemetals","2291","MB-ZN-0102","Zinc premium, 99.995% purity, Italy, delivered duty paid, $ per tonne","USD","gross tonne","weekly",0]
["Basemetals","2292","MB-ZN-0103","Zinc premium, 99.995% purity, Italy duty paid, FCA, $ per tonne","USD","tonne","weekly",0]
["Basemetals","2293","MB-ZN-0104","Zinc premium, 99.995% purity, United States, in warehouse warrants, $ per tonne","USD","tonne","weekly",0]
["Basemetals","2295","MB-ZN-0106","Zinc premium, 99.995% purity, Shanghai, CIF, $ per tonne","USD","tonne","weekly",0]
["Basemetals","2299","MB-ZN-0110","Zinc spot concentrate Treatment Charge (TC), CIF China, $ per tonne","USD","tonne","weekly",0]
["Basemetals","2307","MB-CU-0369","Copper premium, Grade A, cathode, Rotterdam, CIF $ per tonne","USD","tonne","weekly",0]
["Basemetals","2310","MB-CU-0372","Copper premium, Grade A, cathode, Germany, delivered $ per tonne","USD","tonne","weekly",0]
["Basemetals","2315","MB-CU-0377","Copper premium, Grade A, cathode, United States Warrants $ per tonne","USD","tonne","weekly",0]
["Basemetals","2318","MB-CU-0380","Copper premium, Grade A, cathode, Shanghai, CIF ER $ per tonne","USD","tonne","daily",0]
["Basemetals","2320","MB-CU-0382","Copper premium, Grade A, cathode, Shanghai, bonded in-warehouse SX- EW $ per tonne","USD","tonne","daily",0]
["Basemetals","2321","MB-CU-0383","Copper premium, Grade A, cathode, Shanghai, bonded in-warehouse ER $ per tonne","USD","tonne","daily",0]
["Basemetals","2322","MB-CU-0384","Copper premium, Grade A, cathode, Shanghai, CIF SX- EW $ per tonne","USD","tonne","daily",0]
["Basemetals","2323","MB-CU-0385","Copper premium, Grade A, cathode, Japan, CIF $ per tonne","USD","tonne","weekly",0]
["Basemetals","2324","MB-CU-0386","Copper premium, Grade A, cathode, Taiwan, CIF $ per tonne","USD","tonne","weekly",0]
["Basemetals","2339","MB-AL-0307","Aluminium premium, P1020A, South Korea, FCA $/tonne","USD","tonne","weekly",0]
["Basemetals","2344","MB-AL-0312","Aluminium premium, P1020A, Vlissingen, in-warehouse duty-paid, spot $/tonne","USD","tonne","weekly",0]
["Basemetals","2345","MB-AL-0313","Aluminium premium, P1020A, Vlissingen, in-warehouse duty-unpaid, spot $/tonne","USD","tonne","weekly",0]
["Basemetals","2346","MB-AL-0314","Aluminium premium, P1020A, Antwerp, in-warehouse duty-paid  $/tonne","USD","tonne","weekly",0]
["Basemetals","2347","MB-AL-0315","Aluminium premium, P1020A, Antwerp, in-warehouse  duty-unpaid $/tonne","USD","tonne","weekly",0]
["Basemetals","2348","MB-AL-0316","Aluminium premium, P1020A, Italy, FCA duty-paid spot $/tonne","USD","tonne","weekly",0]
["Basemetals","2351","MB-AL-0319","Aluminium premium, P1020A, Spain, FCA duty-paid  $/tonne","USD","tonne","weekly",0]
["Basemetals","2352","MB-AL-0320","Aluminium premium, P1020A, Turkey, FCA duty-unpaid  $/tonne","USD","tonne","weekly",0]
["Basemetals","2360","MB-AL-0328","Aluminium premium, P1020A, Shanghai, bonded  $/tonne","USD","tonne","monthly",0]
["Basemetals","2361","MB-AL-0329","Aluminium premium, P1020A, Taiwan, CIF $/tonne","USD","tonne","weekly",0]
["Basemetals","2372","MB-PB-0083","Lead premium, 99.99% purity, Taiwan CIF $ per tonne","USD","tonne","weekly",0]
["Basemetals","2373","MB-PB-0084","Lead premium, 99.97% purity, Taiwan CIF  $ per tonne","USD","tonne","weekly",0]
["Basemetals","2375","MB-PB-0086","Lead premium, 99.99% purity, India CIF $ per tonne","USD","tonne","weekly",0]
["Basemetals","2376","MB-PB-0087","Lead premium, 99.97% purity, India CIF $ per tonne","USD","tonne","weekly",0]
["Basemetals","2377","MB-PB-0088","FM -Lead premium, 99.97% purity, Rotterdam duty paid FCA  $ per tonne","USD","tonne","weekly",0]
["Basemetals","2378","MB-PB-0089","Lead premium, 99.99% purity, Rotterdam, duty-paid, $ per tonne","USD","tonne","weekly",0]
["Basemetals","2384","MB-PB-0095","Lead premium, 99.97% purity, Italy, duty paid FCA , $ per tonne","USD","tonne","weekly",0]
["Basemetals","2386","MB-PB-0097","Lead premium, 99.97% purity, United States in warehouse  $ per tonne","USD","tonne","weekly",0]
["Basemetals","2388","MB-PB-0099","Lead premium 99.99% purity, Delivered Domestic US, US cents per pound","US Cents","Pound","weekly",0]
["Basemetals","252","MB-AL-0021","Aluminium P1020A, delivered Sao Paulo region, spot, $/tonne","USD","tonne","weekly",0]
["Basemetals","2580","MB-AL-0333","Aluminium premium, P1020A, Southeast Asian warrants, in-warehouse $/tonne","USD","tonne","weekly",0]
["Basemetals","2581","MB-AL-0334","Aluminium premium, P1020A, East Asian warrants, in-warehouse $/tonne","USD","tonne","weekly",0]
["Basemetals","2582","MB-AL-0335","Aluminium premium, P1020A, Singapore, FOB  $/tonne","USD","tonne","weekly",0]
["Basemetals","2583","MB-AL-0336","Aluminium premium, P1020A, Malaysia, FOB  $/tonne","USD","tonne","weekly",0]
["Basemetals","2584","MB-AL-0337","Aluminium premium, P1020A, Turkey, CIF duty-unpaid $/tonne","USD","tonne","weekly",0]
["Basemetals","2585","MB-AL-0338","Aluminium premium, P1020A, US warrants, in-warehouse $/tonne","USD","tonne","weekly",0]
["Basemetals","2586","MB-CU-0397","Copper premium, Grade A cathode, Southeast Asian warrants, in-warehouse $ per tonne","USD","tonne","weekly",0]
["Basemetals","2587","MB-CU-0398","Copper premium, Grade A cathode, East Asian warrants, in-warehouse $ per tonne","USD","tonne","weekly",0]
["Basemetals","2588","MB-CU-0399","Copper premium, Grade A cathode, Southeast Asia, CIF $ per tonne","USD","tonne","weekly",0]
["Basemetals","2589","MB-PB-0105","Lead premium, min 99.97% ingots, Southeast Asian warrants, in-warehouse $ per tonne","USD","tonne","weekly",0]
["Basemetals","2590","MB-PB-0106","Lead premium, min 99.97% ingots, East Asian warrants, in-warehouse $ per tonne","USD","tonne","weekly",0]
["Basemetals","2591","MB-PB-0107","Lead premium, 99.97% ingots, Southeast Asia CIF $ per tonne","USD","tonne","weekly",0]
["Basemetals","2592","MB-PB-0108","Lead premium, 99.99% ingots, Southeast Asia CIF $ per tonne","USD","tonne","weekly",0]
["Basemetals","2593","MB-PB-0109","Lead premium, min 99.97% ingots, North European warrants, in-warehouse $ per tonne","USD","tonne","weekly",0]
["Basemetals","2594","MB-PB-0110","Lead premium, min 99.97% ingots, South European Warrants, in-warehouse $ per tonne","USD","tonne","weekly",0]
["Basemetals","2595","MB-NI-0137","Nickel premium, min 99.80% full plates, Southeast Asian warrants, in-warehouse $/tonne","USD","tonne","weekly",0]
["Basemetals","2596","MB-NI-0138","Nickel premium, min 99.80% briquettes, Southeast Asian warrants, in-warehouse $/tonne","USD","tonne","weekly",0]
["Basemetals","2597","MB-NI-0139","Nickel premium, min 99.80% full plates, East Asian warrants, in-warehouse $/tonne","USD","tonne","weekly",0]
["Basemetals","2598","MB-NI-0140","Nickel premium, min 99.80% briquettes, East Asian warrants, in-warehouse $/tonne","USD","tonne","weekly",0]
["Basemetals","2599","MB-NI-0141","Nickel premium, min 99.80%, North European Warrants, in-warehouse $/tonne","USD","tonne","weekly",0]
["Basemetals","2600","MB-SN-0042","Tin premium, min 99.85%, ingots, Southeast Asian warrants, in-warehouse $/tonne","USD","tonne","weekly",0]
["Basemetals","2604","MB-ZN-0113","Zinc premium, 99.995% SHG ingots, Singapore FCA $ per tonne","USD","tonne","weekly",0]
["Basemetals","2605","MB-ZN-0114","Zinc premium, 99.995% SHG ingots, Malaysia in-warehouse, $ per tonne","USD","tonne","weekly",0]
["Basemetals","2606","MB-ZN-0115","Zinc premium, 99.995% SHG ingots, Malaysia FCA, $ per tonne","USD","tonne","weekly",0]
["Basemetals","2607","MB-ZN-0116","Zinc premium, 99.995% SHG ingots, Taiwan CIF, $ per tonne","USD","tonne","weekly",0]
["Basemetals","2608","MB-ZN-0117","Zinc Premium, min 99.995% SHG ingots, North European Warrants, $ per tonne","USD","tonne","weekly",0]
["Basemetals","2610","MB-CU-0400","Copper premium, Grade A cathode, North European warrants, in-warehouse $ per tonne","USD","tonne","weekly",0]
["Basemetals","2611","MB-CU-0401","Copper premium, Grade A cathode, South European Warrants, in-warehouse $ per tonne","USD","tonne","weekly",0]
["Basemetals","2615","MB-AL-0339","Aluminium wheel alloy silicon 7 ingot delivered Germany duty paid, $ per tonne","USD","tonne","monthly",0]
["Basemetals","2616","MB-AL-0340","Aluminium wheel alloy silicon 7 ingot delivered Eastern Europe duty-paid, $ per tonne","USD","tonne","monthly",0]
["Basemetals","2617","MB-AL-0341","Aluminium wheel alloy silicon 7 ingot CIF Turkey duty-unpaid over P1020, $ per tonne","USD","tonne","monthly",0]
["Basemetals","2618","MB-AL-0342","Aluminium wheel alloy silicon 7 ingot/t-bar dlvd US Midwest duty-unpaid over P1020, cents per Ib","US Cents","Pound","monthly",0]
["Basemetals","2625","MB-BX-0014","Bauxite fob Kamsar, Guinea $ per dry metric ton","USD","dry metric ton","twice weekly",0]
["Basemetals","2626","MB-BX-0015","Bauxite fob Trombetas, Brazil $ per dry metric ton","USD","dry metric ton","twice weekly",0]
["Basemetals","2636","MB-CU-0402","Copper annual premium 8mm copper wire rod, cif Nhava Sheva, $/tonne","USD","tonne","yearly",0]
["Basemetals","2641","MB-AL-0343","Aluminium P1020A, cif main Japanese ports, spot low - high, $ per tonne","USD","tonne","weekly",0]
["Basemetals","2642","MB-CU-0403","Shanghai, Copper premium, Grade A, cathode, cif, low - high, $ per tonne","USD","tonne","daily",0]
["Basemetals","2643","MB-NI-0142","Shanghai, Nickel premium, 99.80% purity, full plate, cif, low - high, $ per tonne","USD","tonne","weekly",0]
["Basemetals","2644","MB-CU-0404","South Korea, Copper premium, Grade A, cathode, cif, low - high, $ per tonne","USD","tonne","weekly",0]
["Basemetals","2645","MB-CU-0405","Shanghai, Copper premium, Grade A, cathode, in-warehouse, low - high, $ per tonne","USD","tonne","daily",0]
["Basemetals","2646","MB-CU-0406","Leghorn, Copper premium, Grade A, cathode, cif, low - high, $ per tonne","USD","tonne","weekly",0]
["Basemetals","2648","MB-AL-0344","Aluminium P1020A, cif Korea (Gwangyang or Busan), spot, low - high, $ per tonne","USD","tonne","weekly",0]
["Basemetals","2649","MB-AL-0345","Aluminium P1020A, cif Shanghai, spot, low - high, $ per tonne","USD","tonne","weekly",0]
["Basemetals","2650","MB-ZN-0118","Singapore, Zinc premium,  99.995% purity, in warehouse, low - high, $ per tonne","USD","tonne","weekly",0]
["Basemetals","2651","MB-ZN-0119","Shanghai, Zinc premium, 99.995% purity, in warehouse, low - high, $ per tonne","USD","tonne","weekly",0]
["Basemetals","2652","MB-NI-0143","Shanghai, Nickel premium, 99.80% purity, in warehouse, low - high, $ per tonne","USD","tonne","weekly",0]
["Basemetals","2653","MB-AL-0346","Aluminium P1020A, in-warehouse Rotterdam duty-unpaid, spot, low - high, $/tonne","USD","tonne","daily",0]
["Basemetals","297","MB-FEN-0001","Nickel pig iron high grade NPI content 10-15% contract price delivered duty paid China RMB per nickel unit price","RMB","nickel unit price","weekly",0]
["Basemetals","298","MB-FEN-0002","Nickel pig iron high grade NPI content 10-15% spot price China RMB per nickel unit price","RMB","nickel unit price","weekly",0]
["Basemetals","299","MB-NIO-0001","Nickel ore 1.8% basis cif China 15-20% Fe Water content: 30-35% Si:Mg ratio<2 Lot size 50,000 tonnes $ per tonne","USD","tonne","weekly",0]
["Basemetals","3","MB-AL-0002","Aluminium 6063 extrusion billet, in-warehouse Rotterdam duty-paid, spot $ per tonne","USD","tonne","twice monthly",0]
["Basemetals","304","MB-CU-0002","Copper Cathode premium Grade 1 delivered domestic US cents/lb","US Cents","Pound","weekly",0]
["Basemetals","305","MB-AL-0022","Aluminium P1020A, cif Brazilian main ports duty-unpaid, spot, $/tonne","USD","tonne","weekly",0]
["Basemetals","340","MB-ZN-0005","Special High Grade Zinc premium delivered domestic US cents/lb","US Cents","Pound","weekly",0]
["Basemetals","341","MB-ZN-0006","Nos. 3 and 7 zinc die cast aly premium delivered domestic US cents/lb","US Cents","Pound","monthly",0]
["Basemetals","342","MB-ZN-0007","No. 5 zinc die cast aly premium delivered domestic US cents/lb","US Cents","Pound","monthly",0]
["Basemetals","343","MB-ZN-0008","No. 2 zinc die cast aly premium delivered domestic US cents/lb","US Cents","Pound","monthly",0]
["Basemetals","344","MB-ZN-0009","No. 8 Zinc-aluminum foundry alloys premium delivered domestic US cents/lb","US Cents","Pound","monthly",0]
["Basemetals","345","MB-ZN-0010","No. 12 Zinc-aluminum foundry alloys premium Delivered Domestic US cents/lb","US Cents","Pound","monthly",0]
["Basemetals","346","MB-ZN-0011","No. 27 Zinc-aluminum foundry alloys premium delivered domestic US cents/lb","US Cents","Pound","monthly",0]
["Basemetals","347","MB-PB-0006","Lead premium 99.97% purity delivered domestic US cents/lb","US Cents","Pound","weekly",0]
["Basemetals","348","MB-NI-0004","Nickel melting material premium 99.8% purity delivered domestic US cents/lb","US Cents","Pound","weekly",0]
["Basemetals","349","MB-NI-0005","Nickel Plat mat premium 99.8% purity delivered domestic US cents/lb","US Cents","Pound","weekly",0]
["Basemetals","367","MB-AL-0040","A380.1 secondary aluminum alloy delivered Midwest cents/lb","US Cents","Pound","twice weekly",0]
["Basemetals","370","MB-AL-0043","A360.1 secondary aluminum alloy delivered Midwest cents/lb","US Cents","Pound","twice weekly",0]
["Basemetals","371","MB-AL-0044","A413.1 secondary aluminum alloy delivered Midwest cents/lb","US Cents","Pound","twice weekly",0]
["Basemetals","396","MB-AL-0045","Aluminum 6061 alloyed ingot cents/lb","US Cents","Pound","monthly",0]
["Basemetals","397","MB-AL-0046","Aluminum 6063 alloyed ingot cents/lb","US Cents","Pound","monthly",0]
["Basemetals","442","MB-AL-0052","Aluminum 6063 extrusion billet upcharge delivered Midwest+B205 cents/lb","US Cents","Pound","twice weekly",0]
["Basemetals","5","MB-AL-0004","Aluminium P1020A, in-warehouse Rotterdam duty-paid, spot $/tonne","USD","tonne","twice weekly",0]
["Basemetals","6","MB-AL-0005","Aluminium pressure diecasting ingot, DIN226/ A380, Europe, delivered consumer works, € per tonne","EURO","tonne","weekly",0]
["Industrial Minerals","1752","MB-ILM-0001","Ilmenite bulk concentrates min 54% TiO2 FOB Australia US $ per tonne","USD","tonne","weekly",0]
["Industrial Minerals","1753","MB-RUT-0001","Rutile concentrate min 95% TiO2 large volumes for pigment FOB Australia US $ per tonne","USD","tonne","weekly",0]
["Industrial Minerals","1756","MB-ZIR-0001","Zircon premium grade min 66.5% ZrO2 bulk FOB Australia US $ per tonne","USD","tonne","weekly",0]
["Industrial Minerals","1757","MB-ZIR-0002","Zircon standard grade min 65.5% ZrO2 bulk FOB Australia US $ per tonne","USD","tonne","weekly",0]
["Industrial Minerals","1758","MB-FLU-0001","Acidspar, 97% CaF2, Wet Filtercake, CIF, Rotterdam, Holland $/tonne","USD","tonne","weekly",0]
["Industrial Minerals","1760","MB-FLU-0003","Acidspar, 97% CaF2, Wet Filtercake, FOB, China $/tonne","USD","tonne","weekly",0]
["Industrial Minerals","1761","MB-FLU-0004","Acidspar, 97% CaF2, Wet Filtercake, FOB, Tampico, Mexico $/tonne","USD","tonne","monthly",0]
["Industrial Minerals","1762","MB-FLU-0005","Fluorspar Acidspar, 97% CaF2, Dry Filtercake, FOB, Durban, South Africa $/tonne","USD","tonne","monthly",0]
["Industrial Minerals","1763","MB-FLU-0006","Acidspar, 97% CaF2, Dry Filtercake, CIF, US Gulf Port, USA $/tonne","USD","tonne","monthly",0]
["Industrial Minerals","1772","MB-FLU-0015","Metspar, min 85% CaF2, FOB, China $/tonne","USD","tonne","weekly",0]
["Industrial Minerals","1773","MB-FLU-0016","Metspar, min 90% CaF2, FOB, China $/tonne","USD","tonne","weekly",0]
["Industrial Minerals","1774","MB-FLU-0017","Metspar, min 85% CaF2, FOB, Tampico, Mexico $/tonne","USD","tonne","weekly",0]
["Industrial Minerals","1779","MB-RUT-0002","Rutile concentrate min. 95% TiO2 bagged, FOB Australia, US $/tonne","USD","tonne","weekly",0]
["Industrial Minerals","1798","MB-DIA-0001","Diatomite, calcined filter-aid grade, FOB US plant, $/tonne","USD","tonne","weekly",0]
["Industrial Minerals","1799","MB-DIA-0002","Diatomite, flux-calcined filter-aid grade, FOB US plant, $/tonne","USD","tonne","weekly",0]
["Industrial Minerals","1800","MB-VER-0001","Vermiculite, South African, bulk, FOB Antwerp, $/tonne","USD","tonne","weekly",0]
["Industrial Minerals","1806","MB-GRA-0002","Graphite Flake, 85-87% C, +100 Mesh -80 Mesh, FCL, CIF, Europe $/tonne","USD","tonne","monthly",0]
["Industrial Minerals","1809","MB-GRA-0005","Graphite Flake, 94-97% C, +100 Mesh -80 Mesh, FCL, CIF, Europe $/tonne","USD","tonne","monthly",0]
["Industrial Minerals","1820","MB-GRA-0016","GraphiteAmorphous, 80-85% C, -200 Mesh, FCL, CIF, China to Europe $/tonne","USD","tonne","monthly",0]
["Industrial Minerals","2026","MB-LI-0012","Spodumene concentrate min 5-6% Li2O, CIF China, $/tonne","USD","tonne","monthly",0]
["Industrial Minerals","2048","MB-LI-0017","Spodumene concentrate min 5-6% Li2O, FOB Australia, $/tonne","USD","tonne","weekly",0]
["Industrial Minerals","2059","MB-ALU-0006","Alumina, fused brown, 95% min Al2O3, refractory sized (0-6mm), FOB China, $/tonne","USD","tonne","weekly",0]
["Industrial Minerals","2061","MB-ALU-0008","Alumina, fused, brown 95% min. Al2O3, FEPA F8-220 grit, FOB China, $/tonne","USD","tonne","weekly",0]
["Industrial Minerals","2072","MB-CHR-0001","Chromite, chemical, 46% Cr2O3, wet bulk, FOB South Africa, $/tonne","USD","tonne","weekly",0]
["Industrial Minerals","2075","MB-CHR-0004","Chromite, foundry, 45.8% min Cr2O3, wet bulk, FOB South Africa $/tonne","USD","tonne","weekly",0]
["Industrial Minerals","2076","MB-CHR-0005","Chromite, foundry, 46% Cr2O3, wet bulk, FOB South Africa $/tonne","USD","tonne","weekly",0]
["Industrial Minerals","2077","MB-CHR-0006","Chromite, refractory grade, 46% Cr2O3, wet bulk, FOB South Africa, $/tonne","USD","tonne","weekly",0]
["Industrial Minerals","2080","MB-I-0001","Iodine crystal, 99.5% min, drums, spot & contract, $/kg","USD","kg","weekly",0]
["Industrial Minerals","2081","MB-I-0002","Iodine crystal, 99.5% min, drums, spot $/kg","USD","kg","weekly",0]
["Industrial Minerals","2082","MB-I-0003","Iodine crystal, 99.5% min, drums, contract $/kg","USD","kg","weekly",0]
["Industrial Minerals","2084","MB-TI-0009","Titanium dioxide pigment, high quality, bulk volume, CFR Asia, $/tonne","USD","tonne","weekly",0]
["Industrial Minerals","2085","MB-TI-0010","Titanium dioxide pigment, bulk volume, CIF Northern Europe, €/tonne","EUR","tonne","weekly",0]
["Industrial Minerals","2086","MB-TI-0011","Titanium dioxide pigment, bulk volume, CIF USA, $/tonne","USD","tonne","weekly",0]
["Industrial Minerals","2088","MB-ALU-0009","Fused alumina, white, 25kg bags, CIF Europe, €/tonne","EUR","tonne","weekly",0]
["Industrial Minerals","2090","MB-SB-0004","Antimony trioxide, typically 99.5% Sb2O3, 5 tonne lots, CIF Antwerp/Rotterdam, $/tonne","USD","tonne","weekly",0]
["Industrial Minerals","2092","MB-SB-0006","Antimony trioxide, typically 99.5% Sb2O3, 20 tonne lots FOB China, $/tonne","USD","tonne","weekly",0]
["Industrial Minerals","2094","MB-SB-0008","Antimony trioxide, typically 99.5% Sb2O3, CIF East Coast USA, $/tonne","USD","tonne","weekly",0]
["Industrial Minerals","2095","MB-ILM-0002","Ilmenite spot price min 54% TiO2 FOB Australia US $ tonne","USD","tonne","weekly",0]
["Industrial Minerals","2096","MB-ILM-0003","Ilmenite bulk concentrates min 54% TiO2 CIF China $/tonne","USD","tonne","weekly",0]
["Industrial Minerals","2097","MB-RUT-0003","Rutile concentrate min 95% TiO2 bulk CIF China $/tonne","USD","tonne","weekly",0]
["Industrial Minerals","2098","MB-LEU-0001","Leucoxene min 91% TiO2 max. 1% ZrO2 bagged FOB West Australia US$/tonne","USD","tonne","weekly",0]
["Industrial Minerals","2099","MB-KAO-0001","Kaolin for tableware, (-45 micron, FCL's bagged > 90 Whiteness), FOB HaiPhong, Vietnam, $/tonne","USD","tonne","weekly",0]
["Industrial Minerals","2100","MB-KAO-0002","Kaolin for tile glaze, (-75 micron, FCL's bagged > 85 whiteness), FOB HaiPhong, Vietnam, $/tonne","USD","tonne","weekly",0]
["Industrial Minerals","2101","MB-KAO-0003","Kaolin for sanitaryware, (-75 micron, FCL's bagged > 75 Whiteness), FOB HaiPhong, Vietnam, $/tonne","USD","tonne","weekly",0]
["Industrial Minerals","2103","MB-KAO-0005","Kaolin, Brazilian kaolin, Paper coating grade, 5% moisture, bulk, C& F Europe, $/tonne","USD","tonne","weekly",0]
["Industrial Minerals","2104","MB-KAO-0006","Kaolin, Brazilian kaolin, Paper coating grade, slurry form, bulk, C& F Europe, $/tonne","USD","tonne","weekly",0]
["Industrial Minerals","2105","MB-KAO-0007","Kaolin, No 1 paper coating grade, Ex-Georgia plant, $/s.ton","USD","short ton","weekly",0]
["Industrial Minerals","2106","MB-KAO-0008","Kaolin, No 2 paper coating grade, Ex-Georgia plant, $/s.ton","USD","short ton","weekly",0]
["Industrial Minerals","2107","MB-MAG-0001","Magnesia, dead-burned, 94-95% MgO, lump, FOB China, $/tonne","USD","tonne","weekly",0]
["Industrial Minerals","2108","MB-MAG-0002","Magnesia, dead-burned, 90% MgO, lump, FOB China, $/tonne","USD","tonne","weekly",0]
["Industrial Minerals","2109","MB-MAG-0003","Magnesia, dead burned, 92% MgO, lump, FOB China, $/tonne","USD","tonne","weekly",0]
["Industrial Minerals","2110","MB-MAG-0004","Magnesia, calcined, 90-92% MgO, FOB China, $/tonne","USD","tonne","weekly",0]
["Industrial Minerals","2111","MB-MAG-0005","Magnesia, dead burned, 97.5% MgO, lump, FOB China, $/tonne","USD","tonne","weekly",0]
["Industrial Minerals","2112","MB-MAG-0006","Magnesia, calcined 94% MgO lump, FOB China, $/tonne","USD","tonne","weekly",0]
["Industrial Minerals","2115","MB-MAG-0009","Magnesia, fused, 97% MgO, Ca:Si 2:1, lump, FOB China, $/tonne","USD","tonne","weekly",0]
["Industrial Minerals","2116","MB-MAG-0010","Magnesia, fused, 96% MgO lump, FOB China, $/tonne","USD","tonne","weekly",0]
["Industrial Minerals","2117","MB-MAG-0011","Magnesia, calcined 96% Mgo lump, FOB China, $/tonne","USD","tonne","weekly",0]
["Industrial Minerals","2118","MB-MAG-0012","Magnesia, European calcined, agricultural, CIF Europe, €/tonne","EUR","tonne","weekly",0]
["Industrial Minerals","2119","MB-MAG-0013","Magnesite, Greek, raw, max 3.5% SiO2, FOB East Mediterranean, €/tonne","EUR","tonne","weekly",0]
["Industrial Minerals","2120","MB-MAG-0014","Magnesia, fused, electrical grade, ex-works UK, $/tonne","USD","tonne","weekly",0]
["Industrial Minerals","2121","MB-MAG-0015","Magnesia, fused, refractory grade, FOB USA, $/tonne","USD","tonne","weekly",0]
["Industrial Minerals","2122","MB-MAG-0016","Magnesia, fused, electrical grade, ex-works USA, $/tonne","USD","tonne","weekly",0]
["Industrial Minerals","2123","MB-MAG-0017","Magnesia, fused, European, FOB Europe, $/tonne","USD","tonne","weekly",0]
["Industrial Minerals","2124","MB-ALU-0011","Alumina, calcined, unground 98.5-99.5% Al2O3, bulk, ex-works US/Europe, long-term contract, $/tonne","USD","tonne","twice monthly",0]
["Industrial Minerals","2125","MB-ALU-0012","Alumina, calcined, ground and unground, min. 99.5% Al2O3, medium-soda min. 0.25% soda, bulk, ex-works US/Europe, long-term contract, $/tonne","USD","tonne","weekly",0]
["Industrial Minerals","2126","MB-ALU-0013","Alumina, calcined, ground 98.5-99.5% Al2O3, bulk, ex-works US/Europe, long-term contract, $/tonne","USD","tonne","weekly",0]
["Industrial Minerals","2127","MB-ALU-0014","Hydrated alumina (ATH), damp (57-60% Al2O3, 5-8% moisture) bulk, FOB refinery, $/tonne","USD","tonne","weekly",0]
["Industrial Minerals","2128","MB-RAE-0001","Cerium oxide, min 99%, FOB, China, $/kg, Bulk","USD","kg","weekly",0]
["Industrial Minerals","2129","MB-RAE-0002","Dysprosium oxide, min 99%, FOB, China, $/kg, Bulk","USD","kg","weekly",0]
["Industrial Minerals","2130","MB-RAE-0003","Europium oxide, min 99%, FOB, China, $/kg, Bulk","USD","kg","weekly",0]
["Industrial Minerals","2131","MB-RAE-0004","Lanthanum oxide, min 99%, FOB, China, $/kg, Bulk","USD","kg","weekly",0]
["Industrial Minerals","2132","MB-RAE-0005","Neodymium oxide, min 99%, FOB, China, $/kg, Bulk","USD","kg","weekly",0]
["Industrial Minerals","2133","MB-RAE-0006","Praseodymium oxide, min 99%, FOB, China, $/kg, Bulk","USD","kg","weekly",0]
["Industrial Minerals","2134","MB-RAE-0007","Samarium oxide, min 99%, FOB, China, $/kg, Bulk","USD","kg","weekly",0]
["Industrial Minerals","2135","MB-POT-0001","Potash muriate, KCl, standard, spot, bulk CFR Brazil, $/tonne","USD","tonne","weekly",0]
["Industrial Minerals","2136","MB-POT-0002","Potash muriate, KCl, standard, bulk, FOB Baltic $/tonne","USD","tonne","weekly",0]
["Industrial Minerals","2137","MB-POT-0003","Potash muriate, standard grade, list, FOB Western Europe, $/tonne","USD","tonne","weekly",0]
["Industrial Minerals","2138","MB-POT-0004","Potash muriate, KCl, granular, bulk, ex-works, North America, $/s.ton","USD","short ton","weekly",0]
["Industrial Minerals","2139","MB-POT-0005","Potash muriate, KCl, standard, bulk, FOB Vancouver, $/tonne","USD","tonne","weekly",0]
["Industrial Minerals","2140","MB-POT-0006","Potash, contract, standard, C&F Western Europe, $/tonne","USD","tonne","weekly",0]
["Industrial Minerals","2148","MB-MN-0002","Manganese, Chemical grade, unground, 74-76% MnO2, Bulk CIF Europe, $/tonne","USD","tonne","weekly",0]
["Industrial Minerals","2149","MB-MN-0003","Manganese, Chemical grade, ground, 74-76% MnO2, Ex-works Europe, $/tonne","USD","tonne","weekly",0]
["Industrial Minerals","2150","MB-MN-0004","Manganese, Chemical grade, unground, 78-80% MnO2, Bulk CIF Europe, $/tonne","USD","tonne","weekly",0]
["Industrial Minerals","2151","MB-MN-0005","Manganese, Chemical grade, ground, 78-80% MnO2, Ex-works Europe, $/tonne","USD","tonne","weekly",0]
["Industrial Minerals","2152","MB-MIC-0001","Mica, dry ground, ex-works UK, £/tonne","GBP","tonne","weekly",0]
["Industrial Minerals","2153","MB-MIC-0002","Mica, flake, FOB plant, USA, $/tonne","USD","tonne","weekly",0]
["Industrial Minerals","2154","MB-MIC-0003","Mica, Indian mine scrap green (Andhra Pradesh) for mica paper, FOB Madras, $/tonne","USD","tonne","weekly",0]
["Industrial Minerals","2155","MB-MIC-0004","Mica, Indian wet-ground, CIF Europe, $/tonne","USD","tonne","weekly",0]
["Industrial Minerals","2156","MB-MIC-0005","Mica, Indian mine scrap, ruby (Andhra Pradesh), FOB Madras, $/tonne","USD","tonne","monthly",0]
["Industrial Minerals","2157","MB-MIC-0006","Mica, Mine scrap, ruby (Bihar), FOB Calcutta, $/tonne","USD","tonne","weekly",0]
["Industrial Minerals","2158","MB-MIC-0007","Mica, Calcined mica flakes, FOB Calcutta, $/tonne","USD","tonne","weekly",0]
["Industrial Minerals","2159","MB-MIC-0008","Mica, Calcined mica powder, FOB Calcutta, $/tonne","USD","tonne","weekly",0]
["Industrial Minerals","2160","MB-MIC-0009","Mica, Chinese dry ground 20-60 mesh, $/tonne","USD","tonne","weekly",0]
["Industrial Minerals","2161","MB-MIC-0010","Mica, (325 mesh FCL's bagged) FOB Durban, $/tonne","USD","tonne","weekly",0]
["Industrial Minerals","2162","MB-MIC-0011","Mica (60 mesh FCL's bagged) FOB Durban, $/tonne","USD","tonne","weekly",0]
["Industrial Minerals","2163","MB-MIC-0012","Mica, dry-ground, FOB plant, USA, $/tonne","USD","tonne","weekly",0]
["Industrial Minerals","2164","MB-MIC-0013","Mica, wet-ground, FOB plant, USA, $/tonne","USD","tonne","weekly",0]
["Industrial Minerals","2165","MB-MIC-0014","Mica, micronised, FOB plant, USA, $/tonne","USD","tonne","weekly",0]
["Industrial Minerals","2403","MB-BAR-0001","Barytes, paint grade, ground, white, 96-98% BaSO4, 350 mesh, 1-5 lots, del. UK, £/tonne","GBP","tonne","weekly",0]
["Industrial Minerals","2404","MB-BAR-0002","Barytes, API, lump, CIF Gulf Coast, Indian $/tonne","USD","tonne","monthly",0]
["Industrial Minerals","2405","MB-BAR-0003","Barytes, Drilling grade, ground SG 4.22, bagged, FOB Morocco, $/tonne","USD","tonne","monthly",0]
["Industrial Minerals","2406","MB-BAR-0004","Barytes, ground, OCMA/API, big bags (1.5t), FOB Southern Turkey, $/tonne","USD","tonne","monthly",0]
["Industrial Minerals","2407","MB-BAR-0005","Barytes, drilling grade, unground lump, OCMA/API, bulk, SG 4.20, C&F North Sea (Moroccan), $/tonne","USD","tonne","monthly",0]
["Industrial Minerals","2408","MB-BAR-0006","Barytes, drilling grade, unground lump, OCMA/API, bulk, SG 4.20, FOB Chennai, $/tonne","USD","tonne","monthly",0]
["Industrial Minerals","2409","MB-BAR-0007","Barytes, drilling grade, API unground lump, SG 4.20, FOB China, $/tonne","USD","tonne","monthly",0]
["Industrial Minerals","2410","MB-BAR-0008","Barytes, chemical grade, Chinese, CIF Gulf Coast $/tonne","USD","tonne","monthly",0]
["Industrial Minerals","2411","MB-BAR-0009","Barytes, paint grade, Chinese lump, CIF Gulf Coast, $/tonne","USD","tonne","weekly",0]
["Industrial Minerals","2413","MB-BAR-0011","Barytes, Indian, API, ground, big bags 1.5 tonnes, FOB Madras, $/tonne","USD","tonne","weekly",0]
["Industrial Minerals","2414","MB-BAR-0012","Barytes, Drilling grade, API unground lump, SG 4.10, FOB China, $/tonne","USD","tonne","weekly",0]
["Industrial Minerals","2415","MB-BAR-0013","Barytes, Drilling grade unground lump, OCMA/API bulk, SG 4.10 FOB Chennai, $/tonne","USD","tonne","weekly",0]
["Industrial Minerals","2416","MB-BAR-0014","Barytes, unground lump, OCMA/API bulk, SG 4.20, FOB Morocco, $/tonne","USD","tonne","weekly",0]
["Industrial Minerals","2417","MB-BAR-0015","Barytes, ground, OCMA bulk, del. Aberdeen, £/tonne","GBP","tonne","weekly",0]
["Industrial Minerals","2418","MB-BAR-0016","Barytes, ground, OCMA bulk, del. Gt Yarmouth, £/tonne","GBP","tonne","weekly",0]
["Industrial Minerals","2419","MB-BAR-0017","Barytes, API, lump, CIF Gulf Coast, Chinese, $/tonne","USD","tonne","weekly",0]
["Industrial Minerals","2420","MB-BOR-0001","Colemanite, 40-42% B2O3, ground, bagged, FOB Argentina, $/tonne","USD","tonne","weekly",0]
["Industrial Minerals","2421","MB-BOR-0002","Ulexite, 40% B2O3, FOB Lima, $/tonne","USD","tonne","weekly",0]
["Industrial Minerals","2422","MB-BOR-0003","Colemanite 40% B2O3, FOB Buenos Aires, $/tonne","USD","tonne","weekly",0]
["Industrial Minerals","2423","MB-BOR-0004","Ulexite, 40% B2O3, FOB Buenos Aires, $/tonne","USD","tonne","weekly",0]
["Industrial Minerals","2424","MB-BOR-0005","Ulexite, granular 40% B2O3, FOB Chile, $/tonne","USD","tonne","weekly",0]
["Industrial Minerals","2425","MB-BOR-0006","Decathydrate Borax, FOB Buenos Aires, $/tonne","USD","tonne","weekly",0]
["Industrial Minerals","2426","MB-BOR-0007","Boric Acid, FOB Chile, $/tonne","USD","tonne","weekly",0]
["Industrial Minerals","2427","MB-BOR-0008","Borax, PP bags (25kg & 50kg), Decahydrate borax, gran, tech, FOB Latin America, $/tonne","USD","tonne","weekly",0]
["Industrial Minerals","2428","MB-BOR-0009","Borax, PP bags (25kg & 50kg), Boric acid, gran, tech, FOB Latin America, $/tonne","USD","tonne","weekly",0]
["Industrial Minerals","2429","MB-BOR-0010","Boric acid, FOB Buenos Aires, $/tonne","USD","tonne","weekly",0]
["Industrial Minerals","2430","MB-BOR-0011","Ulexite 46-48% B2O3, FOB Lima, $/tonne","USD","tonne","weekly",0]
["Industrial Minerals","2431","MB-BR-0001","Bromine, purified, bulk, 99.95% Br, domestic destination, tonne lot, ex-works US, $/lb","USD","pound","weekly",0]
["Industrial Minerals","2433","MB-SOD-0001","Caustic Soda, Spot, bulk, FOB USA, $/s.ton","USD","short ton","weekly",0]
["Industrial Minerals","2434","MB-SOD-0002","Caustic Soda, Contract, bulk, FOB USA, $/s.ton","USD","short ton","weekly",0]
["Industrial Minerals","2435","MB-SOD-0003","Caustic Soda, Spot, bulk, FOB Rotterdam, €/tonne","EUR","tonne","weekly",0]
["Industrial Minerals","2436","MB-SOD-0004","Caustic Soda, Contract, bulk, FOB Rotterdam, €/tonne","EUR","tonne","weekly",0]
["Industrial Minerals","2437","MB-SOD-0005","Caustic Soda, UK liquid caustic soda, £/tonne","GBP","tonne","weekly",0]
["Industrial Minerals","2438","MB-SOD-0006","Caustic Soda, Australian alumina contract prices, FOB Japanese main port, $/tonne","USD","tonne","weekly",0]
["Industrial Minerals","2440","MB-IRX-0001","Iron oxide, brown type 868, bagged, FOB China, $/tonne","USD","tonne","weekly",0]
["Industrial Minerals","2441","MB-IRX-0002","Iron oxide, red type 130 90% Fe2O3, bagged, FOB China, $/tonne","USD","tonne","weekly",0]
["Industrial Minerals","2442","MB-IRX-0003","Micaceous iron oxide, milled, micronized, ex-works Europe, €/kg","EUR","kg","weekly",0]
["Industrial Minerals","2443","MB-IRX-0004","Micaceous iron oxide, Rocks, FOB €/kg","EUR","kg","weekly",0]
["Industrial Minerals","2444","MB-IRX-0005","Micaceous iron oxide, welding grade, container load, FOB Kandla, $/s.ton","USD","short ton","weekly",0]
["Industrial Minerals","2445","MB-IRX-0006","Micaceous iron oxide, paint grade, container load, FOB Kandla, $/s.ton","USD","short ton","weekly",0]
["Industrial Minerals","2446","MB-IRX-0007","Micaceous iron oxide, milled, standard, ex-works Europe, €/kg","EUR","kg","weekly",0]
["Industrial Minerals","2447","MB-KYA-0001","Kyanite, raw kyanite, 55-60% Al2O3, ex-works USA, $/s.ton","USD","short ton","weekly",0]
["Industrial Minerals","2448","MB-KYA-0002","Mullite, calcined kyanite, 55-60% Al2O3,22 ton lots ex-works USA, $/s.ton","USD","short ton","weekly",0]
["Industrial Minerals","2449","MB-OLI-0001","Olivine, refractory grade, bulk, US ex-plant/mine, $/tonne","USD","tonne","weekly",0]
["Industrial Minerals","2450","MB-NIT-0001","Chilean sodium nitrate, approx 98% NaNO3, ex-store, €/tonne","EUR","tonne","weekly",0]
["Industrial Minerals","2451","MB-PER-0001","Perlite, raw, crushed, grade, bulk, FOB Turkey, $/tonne","USD","tonne","weekly",0]
["Industrial Minerals","2452","MB-PER-0002","Perlite, raw, crushed, grade, big bags, FOB Turkey, $/tonne","USD","tonne","weekly",0]
["Industrial Minerals","2453","MB-PER-0003","Perlite, fine and medium (construction), bulk, FOB east Mediterranean, €/tonne","EUR","tonne","weekly",0]
["Industrial Minerals","2454","MB-PER-0004","Perlite, milled filter-aid grade, ex-works USA, $/tonne","USD","tonne","weekly",0]
["Industrial Minerals","2455","MB-PER-0005","Perlite, coarse (filter aid), bulk, FOB east Mediterranean, €/tonne","EUR","tonne","weekly",0]
["Industrial Minerals","2456","MB-PHO-0001","Phosphate rock, 68-72% BPL, long term contract, FAS Casablanca, Morocco, $/tonne","USD","tonne","weekly",0]
["Industrial Minerals","2457","MB-PHO-0002","Phosphate, DAP, FOB Tampa, Florida, $/tonne","USD","tonne","weekly",0]
["Industrial Minerals","2458","MB-PHO-0003","Phosphate, 70-72% BPL, long term contract, FAS Casablanca, Morocco, $/tonne","USD","tonne","weekly",0]
["Industrial Minerals","2459","MB-REC-0001","Clay, European calcined kaolinitic clay, 43% Al2O3, FOB, $/tonne","USD","tonne","weekly",0]
["Industrial Minerals","2460","MB-REC-0002","Clay, European calcined kaolinitic clay, 44% Al2O3, FOB, $/tonne","USD","tonne","weekly",0]
["Industrial Minerals","2461","MB-REC-0003","Clay, Chinese flintclay, 45% Al2O3, CIF N. Europe, $/tonne","USD","tonne","weekly",0]
["Industrial Minerals","2462","MB-REC-0004","Clay, Mulcoa 47% (sized in bulk bags), for coarse sizing, FOB Andersonville, GA, USA, $/s. ton","USD","short ton","weekly",0]
["Industrial Minerals","2463","MB-REC-0005","Clay, Mulcoa 47% (sized in bulk bags), for ceramic milled material, FOB Andersonville, GA, USA, $/s. ton","USD","short ton","weekly",0]
["Industrial Minerals","2464","MB-REC-0006","Clay, Mulcoa 60% (sized in bulk bags), for coarse sizing, FOB USA, $/s. ton","USD","short ton","weekly",0]
["Industrial Minerals","2465","MB-REC-0007","Clay, Mulcoa 60% (sized in bulk bags), for ceramic milled material, FOB USA, $/s. ton","USD","short ton","weekly",0]
["Industrial Minerals","2466","MB-REC-0008","Clay, Mulcoa 70% (sized in bulk bags), for coarse sizing, FOB USA, $/s. ton","USD","short ton","weekly",0]
["Industrial Minerals","2467","MB-REC-0009","Clay, Mulcoa 70% (sized in bulk bags), for ceramic milled material, FOB USA, $/s. ton","USD","short ton","weekly",0]
["Industrial Minerals","2468","MB-REC-0010","Clay, Mulcoa 47% run of kiln, FOB Andersonville, GA, USA, $/s. ton","USD","short ton","weekly",0]
["Industrial Minerals","2469","MB-SAL-0001","Industrial solar salt, ex works China, $/tonne","USD","tonne","weekly",0]
["Industrial Minerals","2470","MB-SAL-0002","Industrial vacuum salt, ex works China $/tonne","USD","tonne","weekly",0]
["Industrial Minerals","2471","MB-SAL-0003","Australian solar salt, bulk CIF Shanghai, $/tonne","USD","tonne","weekly",0]
["Industrial Minerals","2472","MB-SOA-0001","Soda ash, US natural, dense, List price FOB Wyoming, $/tonne","USD","tonne","weekly",0]
["Industrial Minerals","2473","MB-SOA-0002","Soda ash, synthetic, dense and light, small parcels, list price, ex-works Europe, €/tonne","EUR","tonne","weekly",0]
["Industrial Minerals","2474","MB-SOA-0003","Soda ash, Indian synthetic soda ash, Export, FOB, Dense, $/tonne","USD","tonne","weekly",0]
["Industrial Minerals","2475","MB-SOA-0004","Soda ash, Indian synthetic soda ash, Export, FOB, Light, $/tonne","USD","tonne","weekly",0]
["Industrial Minerals","2476","MB-SOA-0005","Soda ash, natural, large contracts, FOB Wyoming, USA, $/tonne","USD","tonne","weekly",0]
["Industrial Minerals","2477","MB-SOA-0006","Soda ash, European synthetic, dense & light, Large Contracts ex-works €/tonne","EUR","tonne","weekly",0]
["Industrial Minerals","2478","MB-SOA-0007","Soda ash, synthetic, dense and light, FOB China, $/tonne","USD","tonne","weekly",0]
["Industrial Minerals","2479","MB-SOA-0008","Soda ash, Chinese synthetic soda ash, dense & light, CIF Far East, $/tonne","USD","tonne","weekly",0]
["Industrial Minerals","2480","MB-SOA-0009","Soda ash, Indian synthetic soda ash, dense & light, Domestic, ex-works India, $/tonne","USD","tonne","weekly",0]
["Industrial Minerals","2481","MB-SOA-0010","Soda ash, synthetic dense and light, for export, C&F India, $/tonne","USD","tonne","weekly",0]
["Industrial Minerals","2482","MB-SOA-0011","Soda ash, US natural, light, list, bulk, FOB Wyoming, $/s.ton","USD","short ton","weekly",0]
["Industrial Minerals","2487","MB-S-0005","Sulphur, Canadian solid, spot, FOB Vancouver $/tonne","USD","tonne","weekly",0]
["Industrial Minerals","2488","MB-S-0006","Sulphur, FOB Middle East, $/tonne","USD","tonne","weekly",0]
["Industrial Minerals","2489","MB-WOL-0001","Wollastonite, acicular, 15:1 to 20:1 aspect ratio, US ex-works, $/s.ton","USD","short ton","weekly",0]
["Industrial Minerals","2490","MB-WOL-0002","Wollastonite, Chinese, FOB, tonne Acicular minus, 200 mesh, $/tonne","USD","tonne","weekly",0]
["Industrial Minerals","2491","MB-WOL-0003","Wollastonite, Chinese, FOB, tonne Acicular minus, 325 mesh, $/tonne","USD","tonne","weekly",0]
["Industrial Minerals","2492","MB-WOL-0004","Wollastonite, Chinese, Powder grades, bulk/big bags, 0-250mm lump, FOB China, $/tonne","USD","tonne","weekly",0]
["Industrial Minerals","2493","MB-WOL-0005","Wollastonite, Chinese, Powder grades, bulk/big bags, 150 mesh, FOB, China, $/tonne","USD","tonne","weekly",0]
["Industrial Minerals","2495","MB-WOL-0007","Wollastonite, Chinese, Powder grades, bulk/big bags, 325 mesh, FOB China, $/tonne","USD","tonne","weekly",0]
["Industrial Minerals","2496","MB-WOL-0008","Wollastonite, acicular -200 mesh, US ex-works, $/s.ton","USD","short ton","weekly",0]
["Industrial Minerals","2497","MB-WOL-0009","Wollastonite, acicular, -325 mesh, US ex-works, $/s.ton","USD","short ton","weekly",0]
["Industrial Minerals","2498","MB-BX-0010","Refractory-grade bauxite 85%/2.0/3.15-3.2 (0-6mm) FOB Xingang $/tonne","USD","tonne","weekly",0]
["Industrial Minerals","2499","MB-BX-0011","Refractory-grade bauxite 85%/2.0/3.15-3.2 (0-6mm) FOB Xingang $/tonne","USD","tonne","weekly",0]
["Industrial Minerals","2500","MB-BX-0012","Refractory-grade bauxite 85%/2.0/3.15-3.2 (0-6mm) FOB Xingang $/tonne","USD","tonne","weekly",0]
["Industrial Minerals","2501","MB-BX-0013","Refractory-grade bauxite 85%/2.0/3.15-3.2 (0-6mm) FOB Xingang $/tonne","USD","tonne","weekly",0]
["Industrial Minerals","2512","MB-BEN-0001","Bentonite, Cat litter grade, crushed, dried and loose in bulk, FOB Kandla, India, $/tonne","USD","tonne","weekly",0]
["Industrial Minerals","2513","MB-BEN-0002","Bentonite, Cat litter grade 1-5mm, bulk, FOB main European port, €/tonne","EUR","tonne","weekly",0]
["Industrial Minerals","2514","MB-BEN-0003","Bentonite, rail hopper cars, crude, bulk (all grades), ex-works Wyoming, USA, $/s.ton","USD","short ton","weekly",0]
["Industrial Minerals","2515","MB-BEN-0004","Bentonite. Foundry grade, bulk, del Japan, $/tonne","USD","tonne","weekly",0]
["Industrial Minerals","2516","MB-BEN-0005","Bentonite, South African., ex-works Fullers' earth, soda ash-treated, foundry grade, bagged, £/tonne","GBP","tonne","weekly",0]
["Industrial Minerals","2517","MB-BEN-0006","Bentonite, fullers' earth, soda ash-treated, Civil eng. grade, ex-works, South Africa, £/tonne","GBP","tonne","weekly",0]
["Industrial Minerals","2518","MB-BEN-0007","Bentonite, IOP grade, crude, bulk, ex-works Wyoming, $/s.ton","USD","short ton","weekly",0]
["Industrial Minerals","2519","MB-BEN-0008","Bentonite, South African., ex-works Fullers' earth, soda ash-treated, Cat litter grade,1-7mm, £/tonne","GBP","tonne","weekly",0]
["Industrial Minerals","2521","MB-BEN-0010","Bentonite, Indian, FOB Kandla, crushed and dried, loose in bulk, Iron ore pelletising grade, $/tonne","USD","tonne","twice monthly",0]
["Industrial Minerals","2522","MB-BEN-0011","Bentonite, cat litter grade, ex-works Wyoming, USA, $/s.ton","USD","short ton","twice monthly",0]
["Industrial Minerals","2523","MB-BEN-0012","Bentonite (dried material in bulk) FOB Greece, €/tonne","EUR","tonne","twice monthly",0]
["Industrial Minerals","2524","MB-BEN-0013","Bentonite OCMA/Foundry grades crude and dried, bulk, FOB Milos, €/tonne","EUR","tonne","twice monthly",0]
["Industrial Minerals","2525","MB-BEN-0014","Bentonite, foundry grade, bagged, rail cars, ex-works Wyoming, $/s.ton","USD","short ton","weekly",0]
["Industrial Minerals","2526","MB-BEN-0015","Bentonite, API grade, bagged, rail car, ex-works, Wyoming, $/s.ton","USD","short ton","weekly",0]
["Industrial Minerals","2536","MB-BR-0002","Bromine, bulk, purified, 99.95% Br, ex works, CIF Europe, $/lb","USD","pound","weekly",0]
["Industrial Minerals","2538","MB-AND-0001","Andalusite, min. 57% Al2O3, FOB South Africa, €/tonne","EUR","tonne","weekly",0]
["Industrial Minerals","2539","MB-AND-0002","Andalusite, min. 57% Al2O3, CIF Europe, €/tonne","EUR","tonne","weekly",0]
["Industrial Minerals","2540","MB-BAD-0001","Baddeleyite, Contract price, Refractory/abrasive grade, CIF main European port, $/tonne","USD","tonne","weekly",0]
["Industrial Minerals","2541","MB-BAD-0002","Baddeleyite, Contract price, Ceramic grade (98% ZrO2 + HfO2), CIF main European port, $/tonne","USD","tonne","weekly",0]
["Industrial Minerals","2542","MB-BAD-0003","Baddeleyite, Contract price, Ceramic pigment grade, CIF main European port, $/tonne","USD","tonne","twice monthly",0]
["Industrial Minerals","2543","MB-CEL-0001","Celestite, Turkish, 96%, SrSO4, FOB Iskenderun, $/tonne","USD","tonne","twice monthly",0]
["Industrial Minerals","2544","MB-FEL-0001","Feldspar, Na feldspar, Crude, -10mm size bulk, FOB Gulluk, Turkey, $/tonne","USD","tonne","twice monthly",0]
["Industrial Minerals","2545","MB-FEL-0002","Feldspar, Na feldspar, Glass grade, -500 microns, bagged, FOB Gulluk, Turkey, $/tonne","USD","tonne","twice monthly",0]
["Industrial Minerals","2546","MB-FEL-0003","Feldspar, (Na), ceramic grade, 170-200 mesh, bagged, ex-works USA, $/s.ton","USD","short ton","twice monthly",0]
["Industrial Minerals","2547","MB-FEL-0004","Feldspar, Na feldspar, floated -500 microns, bulk, FOB Gulluk, Turkey, $/tonne","USD","tonne","weekly",0]
["Industrial Minerals","2548","MB-FEL-0005","Feldspar, Na feldspar, floated -150 microns, bagged, FOB Gulluk, Turkey, $/tonne","USD","tonne","weekly",0]
["Industrial Minerals","2549","MB-FEL-0006","Feldspar (-38 micron, FCL's bagged,>90 Brightness) FOB Durban, South Africa, $/tonne","USD","tonne","weekly",0]
["Industrial Minerals","2550","MB-FEL-0007","Feldspar (-20 micron, FCL's bagged, >92 Brightness) FOB Durban, South Africa, $/tonne","USD","tonne","weekly",0]
["Industrial Minerals","2551","MB-SIS-0001","Silica sand, glass sand, container, ex-works USA, $/tonne","USD","tonne","weekly",0]
["Industrial Minerals","2552","MB-SIS-0002","Silica (20 -micron, FCL's bagged > 92 Brightness) FOB Durban, $/tonne","USD","tonne","weekly",0]
["Industrial Minerals","2553","MB-SIS-0003","Silica (-45 micron, FCL's bagged > 92 Brightness) FOB DaNang, Vietnam, $/tonne","USD","tonne","weekly",0]
["Industrial Minerals","2554","MB-SIS-0004","Silica sand, glass sand, foundry sand in bulk, FOB DaNanag, Vietnam, $/tonne","USD","tonne","weekly",0]
["Industrial Minerals","2555","MB-TAL-0001","Talc, South African, pharmaceutical, FOB Durban $/tonne","USD","tonne","weekly",0]
["Industrial Minerals","2556","MB-TAL-0002","Talc (Cosmetic/Paint 'A' Grade FCL's bagged) FOB Durban, $/tonne","USD","tonne","weekly",0]
["Industrial Minerals","2557","MB-TAL-0003","Talc, (Paint / Soap 'B' Grade FCL's bagged) FOB Durban, $/tonne","USD","tonne","weekly",0]
["Industrial Minerals","2558","MB-TAL-0004","Talc, Chinese normal, 200 mesh , ex-store UK, £/tonne ","GBP","tonne","monthly",0]
["Industrial Minerals","2559","MB-TAL-0005","Talc, Chinese, normal, 350 mesh, ex-store UK, £/tonne","GBP","tonne","monthly",0]
["Industrial Minerals","2560","MB-ZIR-0004","Micronised Zircon, C&F Asia, 99.5% < 4µ, average particle size < 0.95µ, $/tonne","USD","tonne","monthly",0]
["Industrial Minerals","2561","MB-ZIR-0005","Micronised Zircon, 87% < 2µ, average particle size < 0.95µ, $/tonne","USD","tonne","weekly",0]
["Industrial Minerals","2562","MB-ZIR-0006","Zircon Opacifiers, Zircon flour, 95% < 45 microns, bagged, ex-works Europe, US$/tonne","USD","tonne","weekly",0]
["Industrial Minerals","2563","MB-ZIR-0007","Zircon Opacifiers, Micronised zircon, 100% < 6 microns, average 1-2 microns, bagged, ex-works Europe, US$/tonne,","USD","tonne","weekly",0]
["Industrial Minerals","2564","MB-ZIR-0008","Zircon Opacifiers, Zircon flour, 95% < 45 microns, bagged, CFR Asia, US$/tonne","USD","tonne","weekly",0]
["Industrial Minerals","2565","MB-ZIR-0009","Zircon Opacifiers, Micronised zircon, 100% < 6 microns, average 1-2 microns, bagged, CFR Asia, US$/tonne","USD","tonne","weekly",0]
["Industrial Minerals","2566","MB-ZIR-0010","Zircon, premium grade, bulk, FOB USA, $/tonne","USD","tonne","weekly",0]
["Industrial Minerals","2567","MB-ZIR-0011","Zircon, standard grade, bulk, FOB USA, $/tonne","USD","tonne","weekly",0]
["Industrial Minerals","2568","MB-ZIR-0012","Zircon, Ceramic grade, Bulk, FOB South Africa, $/tonne","USD","tonne","weekly",0]
["Industrial Minerals","2569","MB-ZIR-0013","Zircon, ceramic grade, bulk, CIF South Africa, $/tonne","USD","tonne","weekly",0]
["Industrial Minerals","2570","MB-ZIR-0014","Zircon, premium grade, min 66.5% ZrO2, bulk, CIF China, $/tonne","USD","tonne","weekly",0]
["Industrial Minerals","2571","MB-ZIR-0015","Zircon, standard grade, min 65.5% ZrO2, CIF China, $/tonne","USD","tonne","weekly",0]
["Industrial Minerals","2572","MB-ZIR-0016","Fused Zirconia, Monoclinic, refractory/abrasive grade, contract prices, CIF main European port, $/tonne","USD","tonne","weekly",0]
["Industrial Minerals","2573","MB-ZIR-0017","Fused zirconia, Monoclinic, Ceramic pigment grade, Contract price, CIF main European port, $/tonne","USD","tonne","weekly",0]
["Industrial Minerals","2574","MB-ZIR-0018","Fused zirconia, Monoclinic, Structural ceramic/ electronic grade, Contract price, CIF main European port, $/tonne","USD","tonne","weekly",0]
["Industrial Minerals","2575","MB-ZIR-0019","Fused Zirconia, Monoclinic, Technical ceramic, grade, Contract price, CIF main European port, $/tonne","USD","tonne","weekly",0]
["Industrial Minerals","2576","MB-ZIR-0020","Fused Zirconia, Stabilised, Refractory grade, Contract price, CIF main European port, $/tonne","USD","tonne","weekly",0]
["Industrial Minerals","2577","MB-ZIR-0021","Fused Zirconia, Stabilised, Technical ceramic grade, Contract price, CIF main European port, $/tonne","USD","tonne","weekly",0]
["Industrial Minerals","2619","MB-CHO-0003","Chrome Ore South Africa UG2 concentrates index basis 42% cif China, $ per tonne","USD","tonne","weekly",0]
["Industrial Minerals","2631","MB-SIC-0008","Silicon Carbide FEPA 8-220 Black about 99% SIC Acid wash DDP Europe €/tonne","EUR","tonne","weekly",0]
["Industrial Minerals","2632","MB-SIC-0009","Silicon Carbide FEPA 8-220 Black about 99% SIC Water wash DDP Europe €/tonne","EUR","tonne","weekly",0]
["Industrial Minerals","2633","MB-SIC-0010","Silicon Carbide Green over 99.5% SiC, FEPA 8-220 DDP Europe €/tonne","EUR","tonne","weekly",0]
["Industrial Minerals","2634","MB-SIC-0011","Silicon Carbide, Refractory grade min 95% SiC DDP Europe €/tonne","EUR","tonne","weekly",0]
["Industrial Minerals","2635","MB-SIC-0012","Silicon Carbide, Refractory grade min 98% SiC DDP Europe €/tonne","EUR","tonne","weekly",0]
["Industrial Minerals","2638","MB-SB-0009","Antimony trioxide, typically 99.5% Sb2O3, in warehouse Antwerp/Rotterdam, €/kg","EUR","kg","weekly",0]
["Industrial Minerals","2639","MB-SB-0010","Antimony trioxide, typically 99.5% Sb2O3, in warehouse Baltimore, $/lb","USD","pound","weekly",0]
["Industrial Minerals","2666","MB-LI-0018","Lithium carbonate min 99% Li2CO3 technical and industrial grades, contract prices DDP Europe and US, $/kg","USD","kg","weekly",0]
["Industrial Minerals","2667","MB-LI-0019","Lithium carbonate min 99% Li2CO3 technical and industrial grades, spot prices DDP Europe and US, $/kg","USD","kg","weekly",0]
["Industrial Minerals","2668","MB-LI-0020","Lithium hydroxide monohydrate min 56.5% LiOH2O technical and industrial grades, contract  prices DDP Europe and US, $/kg","USD","kg","weekly",0]
["Industrial Minerals","2669","MB-LI-0021","Lithium hydroxide monohydrate min 56.5% LiOH2O technical and industrial grades, spot prices DDP Europe and US, $/kg","USD","kg","weekly",0]
["Industrial Minerals","2670","MB-LI-0022","Lithium carbonate min 99.5% Li2CO3 battery grade, contract prices DDP Europe and US, $/kg","USD","kg","weekly",0]
["Industrial Minerals","2671","MB-LI-0023","Lithium carbonate min 99.5% Li2CO3  battery grade, spot prices DDP Europe and US, $/kg","USD","kg","weekly",0]
["Industrial Minerals","2672","MB-LI-0024","Lithium hydroxide monohydrate min 56.5% LiOH2O battery grade, contract prices DDP Europe and US, $/kg","USD","kg","weekly",0]
["Industrial Minerals","2673","MB-LI-0025","Lithium hydroxide monohydrate min 56.5% LiOH2O battery grade, spot prices DDP Europe and US, $/kg","USD","kg","weekly",0]
["Industrial Minerals","2676","MB-LI-0026","Lithium carbonate min 99% Li2CO3 technical and industrial grades, contract prices CIF China, Japan & Korea, $/kg","USD","kg","weekly",0]
["Industrial Minerals","2677","MB-LI-0027","Lithium carbonate min 99.5% Li2CO3 battery grade, contract prices CIF China, Japan & Korea, $/kg","USD","kg","weekly",0]
["Industrial Minerals","2678","MB-LI-0028","Lithium carbonate min 99% Li2CO3 technical and industrial grades, spot prices CIF China, Japan & Korea, $/kg","USD","kg","weekly",0]
["Industrial Minerals","2679","MB-LI-0029","Lithium carbonate min 99.5% Li2CO3 battery grade, spot prices CIF China, Japan & Korea, $/kg","USD","kg","weekly",0]
["Industrial Minerals","2680","MB-LI-0030","Lithium hydroxide monohydrate min 56.5% LiOH2O technical and industrial grades, contract prices CIF China, Japan & Korea, $/kg","USD","kg","weekly",0]
["Industrial Minerals","2681","MB-LI-0031","Lithium hydroxide monohydrate min 56.5% LiOH2O battery grade, contract prices CIF China, Japan & Korea, $/kg","USD","kg","weekly",0]
["Industrial Minerals","2682","MB-LI-0032","Lithium hydroxide monohydrate min 56.5% LiOH2O technical and industrial grades, spot prices CIF China, Japan & Korea, $/kg","USD","kg","weekly",0]
["Industrial Minerals","2683","MB-LI-0033","Lithium hydroxide monohydrate min 56.5% LiOH2O battery grade, spot prices CIF China, Japan & Korea, $/kg","USD","kg","weekly",0]
["Industrial Minerals","3592","MB-FA-0001","Northern white frac sand, 20/40 mesh, API, EXW Wisconsin, $/short ton","USD","tonne","monthly",0]
["Industrial Minerals",3331,"MB-CHR-0009","Chromite, foundry, 46% Cr2O3, dried and bagged, FOB South Africa $/tonne","USD","tonne","monthly",0]
["Minor metals","1070","MB-CO-0004","Cobalt High Grade MB free market $/ lb in-whs","USD","pound","twice weekly",0]
["Minor metals","1071","MB-CO-0005","Cobalt Low Grade MB free market $/ lb in-whs","USD","pound","twice weekly",0]
["Minor metals","124","MB-GA-0001","Gallium Metal MB $/kg in-whs Rotterdam","USD","kg","twice weekly",0]
["Minor metals","125","MB-GA-0002","Gallium min 99.99% Ga domestic in-whs China RMB/kg","RMB","kg","weekly",0]
["Minor metals","126","MB-GER-0001","Germanium Dioxide in-whs China $/kg","USD","kg","weekly",0]
["Minor metals","128","MB-GER-0003","Germanium Metal MB $/kg in-whs Rotterdam","USD","kg","twice weekly",0]
["Minor metals","129","MB-GER-0004","Germanium metal min 99.999% Ge domestic in-whs China RMB/kg","RMB","kg","weekly",0]
["Minor metals","1375","MB-CO-0012","Cobalt tetroxide min 72.6% Co delivered China RMB/tonne","RMB","tonne","twice weekly",0]
["Minor metals","138","MB-In-0002","Indium ingots in-whs Rotterdam $/kg","USD","kg","twice weekly",0]
["Minor metals","139","MB-In-0003","Indium min 99.99%  domestic in-whs China RMB/kg","RMB","kg","weekly",0]
["Minor metals","141","MB-MG-0001","Magnesium in-whs Europe $/tonne","USD","tonne","weekly",0]
["Minor metals","142","MB-MN-0001","Manganese min. 99.7% electrolytic manganese flake MB free market $/tonne in-whs","USD","tonne","twice weekly",0]
["Minor metals","143","MB-HG-0001","Mercury in-whs $/flask","USD","flask","twice monthly",0]
["Minor metals","150","MB-RE-0001","Rhenium MB APR Catalytic grade $/kg in-whs Rotterdam DUP","USD","kg","twice monthly",0]
["Minor metals","151","MB-RE-0002","Rhenium MB Metal Pellets min 99.9% $/lb in-whs Rotterdam DUP","USD","pound","twice monthly",0]
["Minor metals","161","MB-SE-0001","Selenium dioxide MB min 98% China domestic in-whs RMB/kg","RMB","kg","weekly",0]
["Minor metals","162","MB-SE-0002","Selenium in warehouse $/lb","USD","pound","weekly",0]
["Minor metals","1628","MB-In-0004","Indium ingots min 99.97% Indium Corp $ per kg fob","USD","kg","when changed",0]
["Minor metals","163","MB-SE-0003","Selenium min 99.9% Se domestic in warehouse  China RMB/kg","RMB","kg","weekly",0]
["Minor metals","166","MB-SI-0001","Silicon grade 441 min 99% Si in-whs Rotterdam € per tonne","EUR","tonne","weekly",0]
["Minor metals","173","MB-TE-0001","Tellurium Metal MB min. 99.9% $/kg","USD","kg","twice weekly",0]
["Minor metals","174","MB-TE-0002","Tellurium min 99.99% Te  domestic in warehouse China RMB/kg","RMB","kg","weekly",0]
["Minor metals","2028","MB-ZIR-0003","Hafnium 1% Zr max in-whs global locations $ per kg","USD","kg","twice monthly",0]
["Minor metals","22","MB-SB-0001","Antimony max 100 ppm Bi in-whs Rotterdam $/tonne","USD","tonne","twice weekly",0]
["Minor metals","23","MB-SB-0002","Antimony Metal MMTA Standard Grade II $/tonne in-whs Rotterdam","USD","tonne","twice weekly",0]
["Minor metals","24","MB-SB-0003","Antimony metal MMTA Standard Grade II delivered duty paid RMB/tonne","RMB","tonne","weekly",0]
["Minor metals","253","MB-MG-0002","Magnesium min 99.8% Mg fob China main ports $/tonne","USD","tonne","weekly",0]
["Minor metals","254","MB-MG-0003","Magnesium Metal MB Chinese free market min 99% Mg ex-works RMB/tonne","RMB","tonne","weekly",0]
["Minor metals","255","MB-SI-0002","Silicon export from mainland China 98.5% $/tonne fob","USD","tonne","weekly",0]
["Minor metals","256","MB-CO-0001","Cobalt Metal MB domestic min 99.8% China RMB/tonne","RMB","tonne","twice weekly",0]
["Minor metals","2630","MB-SI-0004","Silicon grade 553 min 98.5% Si in-whs Rotterdam € per tonne","EUR","tonne","weekly",0]
["Minor metals","29","MB-AS-0001","Arsenic MB free market $ per lb in-whs","USD","tonne","twice monthly",0]
["Minor metals","30","MB-BI-0001","Bismuth in-whs $/lb","USD","pound","twice weekly",0]
["Minor metals","31","MB-BI-0002","Bismuth min 99.99% domestic in-whs China RMB/tonne","RMB","tonne","weekly",0]
["Minor metals","36","MB-CD-0001","Cadmium min 99.95% in-whs cents/lb","US Cents","pound","twice weekly",0]
["Minor metals","37","MB-CD-0002","Cadmium min. 99.99% in-whs cents/lb","US Cents","pound","twice weekly",0]
["Minor metals","398","MB-TI-0003","Titanium Sponge  rotor quality FOB shipping point Japan  US$/lb","USD","pound","monthly",0]
["Minor metals","399","MB-TI-0004","Titanium ingot 6AI-4V FOB shipping point US$/lb","USD","pound","quarterly",0]
["Minor metals","400","MB-TI-0005","Titanium plate alloy AMS 4911 FOB shipping point US$/lb","USD","pound","quarterly",0]
["Minor metals","401","MB-TI-0006","Titanium bar alloy AMS 4928 FOB shipping point US$/lb","USD","pound","quarterly",0]
["Minor metals","402","MB-TI-0007","Titanium plate commercially pure FOB shipping point US$/lb","USD","pound","quarterly",0]
["Minor metals","403","MB-TI-0008","Titanium sheet commercially pure FOB shipping point US$/lb","USD","pound","quarterly",0]
["Minor metals","41","MB-CR-0001","Chromium alumino-thermic min 99% in-whs $/tonne","USD","tonne","weekly",0]
["Minor metals","440","MB-SI-0003","Silicon free market price domestic US delivered US cents per pound","US Cents","pound","monthly",0]
["Minor metals","441","MB-MG-0004","Magnesium free market price domestic US delivered. US Dollar per pound","USD","pound","quarterly",0]
["Ore & Alloys","101","MB-FEC-0003","Ferro-chrome 0.10% C average 60-70% Cr major European destinations $ per lb Cr","USD","pound","weekly",0]
["Ore & Alloys","102","MB-FEC-0004","Ferro-chrome 6-8% C basis 60% Cr max. 1.5% Si major European destinations $ per lb Cr","USD","pound","weekly",0]
["Ore & Alloys","103","MB-FEC-0005","Ferro-chrome China Contract 6-8% C basis 50% Cr delivered duty paid China RMB/tonne","RMB","tonne","weekly",0]
["Ore & Alloys","104","MB-FEC-0006","Ferro-chrome China Spot 6-8% C, basis 50% Cr delivered duty paid China RMB/tonne","RMB","tonne","weekly",0]
["Ore & Alloys","105","MB-FEC-0007","Ferrochrome high carbon 6-8% C basis 60-65% Cr max 2% Si in warehouse Pittsburgh cents/lb","US Cents","pound","weekly",0]
["Ore & Alloys","106","MB-FEC-0008","Ferrochrome low carbon 0.05%C - 65% min cr in warehouse Pittsburgh cents/lb","US Cents","pound","weekly",0]
["Ore & Alloys","107","MB-FEC-0009","Ferrochrome low carbon 0.10%C - 62% min Cr in warehouse Pittsburgh cents/lb","US Cents","pound","weekly",0]
["Ore & Alloys","1078","MB-SIM-0004","Silico-manganese 65% min Mn 16% min Si $ per tonne fob India","USD","tonne","weekly",0]
["Ore & Alloys","108","MB-FEC-0010","Ferrochrome low carbon 0.15%C - 60% min Cr in warehouse Pittsburgh cents/lb","US Cents","pound","weekly",0]
["Ore & Alloys","109","MB-FEW-0001","Ferro-manganese basis 78% Mn (Scale pro rata) - Standard 7.5% C major European destinations € per tonne","EUR","tonne","weekly",0]
["Ore & Alloys","110","MB-FEW-0002","Ferro-manganese min 65% Mn max 7.0% C in warehouse China RMB/tonne","RMB","tonne","weekly",0]
["Ore & Alloys","111","MB-FEM-0001","Ferromanganese high carbon 78% Mn Standard 7.5% C in warehouse Pittsburgh $/long ton","USD","long ton","weekly",0]
["Ore & Alloys","112","MB-FEM-0002","Ferromanganese low carbon 80% Mn max. 0.80% C cents/lb","US Cents","pound","weekly",0]
["Ore & Alloys","113","MB-FEM-0003","Ferromanganese Medium carbon 80% Mn max 1.50% C cents/lb","US Cents","pound","weekly",0]
["Ore & Alloys","114","MB-FEO-0001","Ferro-molybdenum basis 65% min, in-warehouse Rotterdam, $ per kg Mo","USD","kg","twice weekly",0]
["Ore & Alloys","115","MB-FEO-0002","Ferromolybdenum 65-70% Mo $/lb","USD","pound","weekly",0]
["Ore & Alloys","116","MB-FES-0001","Ferro-silicon China min 75% Si, in warehouse China RMB/tonne","RMB","tonne","weekly",0]
["Ore & Alloys","117","MB-FEH-0001","Ferro-silicon export from mainland China Min 75% Si 7.5% C fob $/tonne","USD","tonne","weekly",0]
["Ore & Alloys","118","MB-FEH-0002","Ferro-silicon lumpy basis 75% Si (Scale pro rata) major European destinations € per tonne","EUR","tonne","weekly",0]
["Ore & Alloys","119","MB-FES-0002","Ferrosilicon 75% Si in warehouse Pittsburgh cents/lb","US Cents","pound","weekly",0]
["Ore & Alloys","120","MB-FET-0001","Ferro-titanium 70% (max 4.5% Al) MB $ per kg Ti d/d Europe","USD","kg","weekly",0]
["Ore & Alloys","121","MB-FEU-0001","Ferro-tungsten basis 75% W Rotterdam duty unpaid $ per kg W in warehouse ","USD","kg","twice weekly",0]
["Ore & Alloys","122","MB-FEV-0001","Ferro-vanadium basis 78% min, free delivered duty paid, consumer plant,1st grade Western Europe, $ per kg V","USD","kg","twice weekly",0]
["Ore & Alloys","123","MB-FEV-0002","Ferrovanadium 70-80% V $/lb","USD","pound","weekly",0]
["Ore & Alloys","1409","MB-FEC-0011","Ferro-chrome China import 50% Cr US $ per Ib contained chrome CIF Shanghai","USD","pound","weekly",0]
["Ore & Alloys","1410","MB-MNO-0001","Manganese Ore Index 44% Mn, Cif Tianjin $ per dmtu of metal contained","USD","dmtu","weekly",0]
["Ore & Alloys","1411","MB-MNO-0002","Manganese Ore Index 37% Mn, Fob Port Elizabeth $ per dmtu of metal contained","USD","dmtu","weekly",0]
["Ore & Alloys","144","MB-FEO-0003","Molybdenum MB Drummed Molybdic Oxide $ per lb Mo in warehouse","USD","pound","twice weekly",0]
["Ore & Alloys","145","MB-MO-0001","Molybdenum canned molybdic oxide $/lb","USD","pound","weekly",0]
["Ore & Alloys","149","MB-CHO-0002","Chrome Ore ports Turkish lumpy 40-42% $ per tonne cfr main Chinese","USD","tonne","weekly",0]
["Ore & Alloys","179","MB-W-0001","Tungsten APT European free market $/ mtu","USD","mtu","weekly",0]
["Ore & Alloys","1842","MB-FEC-0016","Ferro-chrome lumpy Cr charge, basis 52% Cr, (and high carbon) quarterly $/lb","USD","pound","quarterly",0]
["Ore & Alloys","197","MB-V-0001","Vanadium pentoxide V2O5 min 98% in-warehouse Rotterdam $/lb","USD","pound","weekly",0]
["Ore & Alloys","2007","MB-FEU-0002","Ferro-Tungsten, China export min 75% $ per kg W, fob China","USD","kg","weekly",0]
["Ore & Alloys","2071","MB-FEC-0017","Ferro-chrome Japan import 8-9% C, basis 60% Cr, CIF Japan, duty unpaid, $ per lb contained chrome","USD","pound","weekly",0]
["Ore & Alloys","2273","MB-FEC-0018","Ferro-chrome South Korea import 8-9% C, basis 60% Cr, CIF South Korea, duty unpaid, $ per lb contained chrome ","USD","pound","weekly",0]
["Ore & Alloys","258","MB-MO-0002","Molybdenum concentrate MB Chinese free market, 45% Mo in warehouse China RMB/mtu","RMB","mtu","weekly",0]
["Ore & Alloys","259","MB-W-0002","Tungsten concentrate MB Chinese free market, 65% W03, in warehouse China RMB/tonne","RMB","tonne","weekly",0]
["Ore & Alloys","260","MB-W-0003","Tungsten APT export from mainland China, Chinese number 1 grade, min 88.5% WO 3, $/mtu, fob","USD","mtu","weekly",0]
["Ore & Alloys","2609","MB-FEC-0019","Ferro-Chrome European Benchmark Indicator, Lumpy Cr charge basis 52% (and high carbon), $ per Ib","USD","pound","weekly",0]
["Ore & Alloys","368","MB-AL-0041","319.1 secondary aluminum alloy delivered Midwest cents/lb","US Cents","pound","twice weekly",0]
["Ore & Alloys","369","MB-AL-0042","356.1 secondary aluminum alloy delivered Midwest cents/lb","US Cents","pound","twice weekly",0]
["Precious Metals",1486,{"$error":"#N/A"},"Platinum min 99.9% Europe Free Market $ per troy oz in warehouse","USD","troy oz","twice weekly",0]
["Precious Metals",1487,{"$error":"#N/A"},"Palladium min 99.9% Europe Free Market $ per troy oz in warehouse","USD","troy oz","twice weekly",0]
["Precious Metals",1488,{"$error":"#N/A"},"Rhodium min 99.9% Europe Free Market $ per troy oz in warehouse","USD","troy oz","twice weekly",0]
["Precious Metals",1489,{"$error":"#N/A"},"Iridium ingot min 99.9% Europe Free Market $ per troy oz in warehouse","USD","troy oz","twice weekly",0]
["Precious Metals",1490,{"$error":"#N/A"},"Ruthenium min 99.9% Europe Free Market $ per troy oz in warehouse","USD","troy oz","twice weekly",0]
["Precious Metals",2394,{"$error":"#N/A"},"Gold 99.99%, Shanghai, 1Kg in USD per ounce in SGE vault","USD","ounce","twice monthly",0]
["Precious Metals",2395,{"$error":"#N/A"},"Gold 99.99%, Hong Kong, 1Kg  in USD per ounce DAT","USD","ounce","twice monthly",0]
["Precious Metals",2396,{"$error":"#N/A"},"Gold 99.99%, Singapore,  1Kg  in USD per ounce DAT","USD","ounce","twice monthly",0]
["Precious Metals",2397,{"$error":"#N/A"},"Gold 99.99%, Tokyo,  1Kg in USD per ounce DAT","USD","ounce","twice monthly",0]
["Precious Metals",2398,{"$error":"#N/A"},"Gold 99.5%, Mumbai,  1Kg in USD per ounce DAT","USD","ounce","twice monthly",0]
["Precious Metals",2399,{"$error":"#N/A"},"Gold 99.99%, Bangkok,  1Kg in USD per ounce DAT","USD","ounce","twice monthly",0]
["Precious Metals",2400,{"$error":"#N/A"},"Gold 99.5%, Istanbul,  1Kg in USD per ounce DAT","USD","ounce","twice monthly",0]
["Precious Metals",2401,{"$error":"#N/A"},"Gold 99.99%, Dubai,  1Kg in USD per ounce DAT","USD","ounce","twice monthly",0]
["Precious Metals",2402,{"$error":"#N/A"},"Gold 99.99%, Zurich,  1Kg in USD per ounce DAT","USD","ounce","twice monthly",0]
["Scrap",2620,"MB-STS-0259","UK domestic 316 solids wholesale £ per tonne del merchants","GBP","tonne","Weekly",0]
["Scrap",2621,"MB-STS-0260","UK domestic 316 turnings wholesale £ per tonne del merchants","GBP","tonne","Weekly",0]
["Scrap",2622,"MB-STS-0261","Europe import 316 solids € per tonne cif main European port","EUR","tonne","Weekly",0]
["Scrap",2623,"MB-STS-0262","Europe import 316 turnings € per tonne cif main European port","EUR","tonne","Weekly",0]
["Scrap",2920,{"$error":"#N/A"},"Dealer nickel scrap solids - Chicago US cents per pound","US Cents","pound","twice monthly",0]
["Scrap",2921,{"$error":"#N/A"},"Dealer nickel turnings scrap - Chicago US cents per pound","US Cents","pound","twice monthly",0]
["Scrap",2922,{"$error":"#N/A"},"Dealer Monel R-400 scrap solids, clips - Chicago US cents per pound","US Cents","pound","twice monthly",0]
["Scrap",2923,{"$error":"#N/A"},"Dealer Monel scrap turnings - Chicago US cents per pound","US Cents","pound","twice monthly",0]
["Scrap",2924,{"$error":"#N/A"},"Dealer Monel K-500 (castings) solids, clips - Chicago US cents per pound","US Cents","pound","twice monthly",0]
["Scrap",2925,{"$error":"#N/A"},"Dealer Inconel 600 scrap solids, clips - Chicago US cents per pound","US Cents","pound","twice monthly",0]
["Scrap",2926,{"$error":"#N/A"},"Dealer 309 stainless steel scrap solids - Chicago US cents per pound","US Cents","pound","twice monthly",0]
["Scrap",2927,{"$error":"#N/A"},"Dealer 310 stainless steel scrap solids - Chicago US cents per pound","US Cents","pound","twice monthly",0]
["Scrap",2928,{"$error":"#N/A"},"Dealer 330 stainless steel scrap solids - Chicago US cents per pound","US Cents","pound","twice monthly",0]
["Scrap",2929,{"$error":"#N/A"},"Dealer Invar scrap solids, clips - Chicago US cents per pound","US Cents","pound","twice monthly",0]
["Scrap",2930,{"$error":"#N/A"},"Dealer Inconel 601 scrap solids, clips - Chicago US cents per pound","US Cents","pound","twice monthly",0]
["Scrap",2931,{"$error":"#N/A"},"Dealer 17-4PH solids - Chicago US cents per pound","US Cents","pound","twice monthly",0]
["Scrap",2932,{"$error":"#N/A"},"Dealer nickel scrap solids - Detroit US cents per pound","US Cents","pound","twice monthly",0]
["Scrap",2933,{"$error":"#N/A"},"Dealer nickel turnings scrap - Detroit US cents per pound","US Cents","pound","twice monthly",0]
["Scrap",2934,{"$error":"#N/A"},"Dealer Monel R-400 scrap solids, clips - Detroit US cents per pound","US Cents","pound","twice monthly",0]
["Scrap",2935,{"$error":"#N/A"},"Dealer Monel scrap turnings - Detroit US cents per pound","US Cents","pound","twice monthly",0]
["Scrap",2936,{"$error":"#N/A"},"Dealer Monel K-500 (castings) solids, clips - Detroit US cents per pound","US Cents","pound","twice monthly",0]
["Scrap",2937,{"$error":"#N/A"},"Dealer Inconel 600 scrap solids, clips - Detroit US cents per pound","US Cents","pound","twice monthly",0]
["Scrap",2938,{"$error":"#N/A"},"Dealer 309 stainless steel scrap solids - Detroit US cents per pound","US Cents","pound","twice monthly",0]
["Scrap",2939,{"$error":"#N/A"},"Dealer 310 stainless steel scrap solids - Detroit US cents per pound","US Cents","pound","twice monthly",0]
["Scrap",2940,{"$error":"#N/A"},"Dealer 330 stainless steel scrap solids - Detroit US cents per pound","US Cents","pound","twice monthly",0]
["Scrap",2941,{"$error":"#N/A"},"Dealer Invar scrap solids, clips - Detroit US cents per pound","US Cents","pound","twice monthly",0]
["Scrap",2942,{"$error":"#N/A"},"Dealer Inconel 601 scrap solids, clips - Detroit US cents per pound","US Cents","pound","twice monthly",0]
["Scrap",2943,{"$error":"#N/A"},"Dealer 17-4PH solids - Detroit US cents per pound","US Cents","pound","twice monthly",0]
["Scrap",2944,{"$error":"#N/A"},"Dealer nickel scrap solids - Houston US cents per pound","US Cents","pound","twice monthly",0]
["Scrap",2945,{"$error":"#N/A"},"Dealer nickel turnings scrap - Houston US cents per pound","US Cents","pound","twice monthly",0]
["Scrap",2946,{"$error":"#N/A"},"Dealer Monel R-400 scrap solids, clips - Houston US cents per pound","US Cents","pound","twice monthly",0]
["Scrap",2947,{"$error":"#N/A"},"Dealer Monel scrap turnings - Houston US cents per pound","US Cents","pound","twice monthly",0]
["Scrap",2948,{"$error":"#N/A"},"Dealer Monel K-500 (castings) solids, clips - Houston US cents per pound","US Cents","pound","twice monthly",0]
["Scrap",2949,{"$error":"#N/A"},"Dealer Inconel 600 scrap solids, clips - Houston US cents per pound","US Cents","pound","twice monthly",0]
["Scrap",2950,{"$error":"#N/A"},"Dealer 309 stainless steel scrap solids - Houston US cents per pound","US Cents","pound","twice monthly",0]
["Scrap",2951,{"$error":"#N/A"},"Dealer 310 stainless steel scrap solids - Houston US cents per pound","US Cents","pound","twice monthly",0]
["Scrap",2952,{"$error":"#N/A"},"Dealer 330 stainless steel scrap solids - Houston US cents per pound","US Cents","pound","twice monthly",0]
["Scrap",2953,{"$error":"#N/A"},"Dealer Invar scrap solids, clips - Houston US cents per pound","US Cents","pound","twice monthly",0]
["Scrap",2954,{"$error":"#N/A"},"Dealer Inconel 601 scrap solids, clips - Houston US cents per pound","US Cents","pound","twice monthly",0]
["Scrap",2955,{"$error":"#N/A"},"Dealer 17-4PH solids - Houston US cents per pound","US Cents","pound","twice monthly",0]
["Scrap",2956,{"$error":"#N/A"},"Dealer nickel scrap solids - Pittsburgh US cents per pound","US Cents","pound","twice monthly",0]
["Scrap",2957,{"$error":"#N/A"},"Dealer nickel turnings scrap - Pittsburgh US cents per pound","US Cents","pound","twice monthly",0]
["Scrap",2958,{"$error":"#N/A"},"Dealer Monel R-400 scrap solids, clips - Pittsburgh US cents per pound","US Cents","pound","twice monthly",0]
["Scrap",2959,{"$error":"#N/A"},"Dealer Monel scrap turnings - Pittsburgh US cents per pound","US Cents","pound","twice monthly",0]
["Scrap",2960,{"$error":"#N/A"},"Dealer Monel K-500 (castings) solids, clips - Pittsburgh US cents per pound","US Cents","pound","twice monthly",0]
["Scrap",2961,{"$error":"#N/A"},"Dealer Inconel 600 scrap solids, clips - Pittsburgh US cents per pound","US Cents","pound","twice monthly",0]
["Scrap",2962,{"$error":"#N/A"},"Dealer 309 stainless steel scrap solids - Pittsburgh US cents per pound","US Cents","pound","twice monthly",0]
["Scrap",2963,{"$error":"#N/A"},"Dealer 310 stainless steel scrap solids - Pittsburgh US cents per pound","US Cents","pound","twice monthly",0]
["Scrap",2964,{"$error":"#N/A"},"Dealer 330 stainless steel scrap solids - Pittsburgh US cents per pound","US Cents","pound","twice monthly",0]
["Scrap",2965,{"$error":"#N/A"},"Dealer Invar scrap solids, clips - Pittsburgh US cents per pound","US Cents","pound","twice monthly",0]
["Scrap",2966,{"$error":"#N/A"},"Dealer Inconel 601 scrap solids, clips - Pittsburgh US cents per pound","US Cents","pound","twice monthly",0]
["Scrap",2967,{"$error":"#N/A"},"Dealer 17-4PH solids - Pittsburgh US cents per pound","US Cents","pound","twice monthly",0]
["Scrap","10","MB-AL-0009","Aluminium Scrap, Clean HE9 extrusions, United Kingdom, delivered consumer works, £ per tonne","GBP","tonne","Weekly",0]
["Scrap","1081","MB-STE-0213","Alabama No. 1 heavy melt scrap consumer buying price $/gross ton","USD","gross ton","Monthly",0]
["Scrap","1082","MB-STE-0214","Alabama No. 2 heavy melt scrap consumer buying price $/gross ton","USD","gross ton","Monthly",0]
["Scrap","1083","MB-STE-0215","Alabama No. 1 bundles scrap consumer buying price $/gross ton","USD","gross ton","Monthly",0]
["Scrap","1084","MB-STE-0216","Alabama No. 1 busheling scrap consumer buying price $/gross ton","USD","gross ton","Monthly",0]
["Scrap","1085","MB-STE-0217","Alabama Shredded auto scrap consumer buying price $/gross ton","USD","gross ton","Monthly",0]
["Scrap","1086","MB-STE-0218","Alabama Machine shop turnings scrap consumer buying price $/gross ton","USD","gross ton","Monthly",0]
["Scrap","1087","MB-STE-0219","Alabama Cut structural/plate 3ft. max. scrap consumer buying price $/gross ton","USD","gross ton","Monthly",0]
["Scrap","1088","MB-STE-0220","Alabama Cut structural/plate 5ft. max. scrap consumer buying price $/gross ton","USD","gross ton","Monthly",0]
["Scrap","1089","MB-STE-0221","Arkansas/Tenn No. 1 heavy melt scrap consumer buying price $/gross ton","USD","gross ton","Monthly",0]
["Scrap","1090","MB-STE-0222","Arkansas/Tenn No. 1 bundles scrap consumer buying price $/gross ton","USD","gross ton","Monthly",0]
["Scrap","1091","MB-STE-0223","Arkansas/Tenn No. 2 bundles scrap consumer buying price $/gross ton","USD","gross ton","Monthly",0]
["Scrap","1092","MB-STE-0224","Arkansas/Tenn No. 1 busheling scrap consumer buying price $/gross ton","USD","gross ton","Monthly",0]
["Scrap","1093","MB-STE-0225","Arkansas/Tenn Shredded auto scrap consumer buying price $/gross ton","USD","gross ton","Monthly",0]
["Scrap","1094","MB-STE-0226","Arkansas/Tenn Machine shop turnings scrap consumer buying price $/gross ton","USD","gross ton","Monthly",0]
["Scrap","1095","MB-STE-0227","Arkansas/Tenn Cut structural/plate 5ft. max. scrap consumer buying price $/gross ton","USD","gross ton","Monthly",0]
["Scrap","1096","MB-STE-0228","Chicago No. 1 heavy melt scrap consumer buying price $/gross ton","USD","gross ton","Monthly",0]
["Scrap","1097","MB-STE-0229","Chicago No. 2 heavy melt scrap consumer buying price $/gross ton","USD","gross ton","Monthly",0]
["Scrap","1098","MB-STE-0230","Chicago No. 1 bundles scrap consumer buying price $/gross ton","USD","gross ton","Monthly",0]
["Scrap","1099","MB-STE-0231","Chicago No. 2 bundles scrap consumer buying price $/gross ton","USD","gross ton","Monthly",0]
["Scrap","11","MB-AL-0010","Aluminium Scrap, Commercial Cast, United Kingdom, delivered consumer works, £ per tonne","GBP","tonne","Weekly",0]
["Scrap","1100","MB-STE-0232","Chicago No. 1 busheling scrap consumer buying price $/gross ton","USD","gross ton","Monthly",0]
["Scrap","1101","MB-STE-0233","Chicago Shredded auto scrap consumer buying price $/gross ton","USD","gross ton","Monthly",0]
["Scrap","1102","MB-STE-0234","Chicago Machine shop turnings scrap consumer buying price $/gross ton","USD","gross ton","Monthly",0]
["Scrap","1103","MB-STE-0235","Chicago Cast iron borings scrap consumer buying price $/gross ton","USD","gross ton","Monthly",0]
["Scrap","1104","MB-STE-0236","Chicago Cut structural/plate 2ft. max. scrap consumer buying price $/gross ton","USD","gross ton","Monthly",0]
["Scrap","1105","MB-STE-0237","Chicago Cut structural/plate 5ft. max. scrap consumer buying price $/gross ton","USD","gross ton","Monthly",0]
["Scrap","1106","MB-STE-0238","Chicago Foundry steel 2ft. max. scrap consumer buying price $/gross ton","USD","gross ton","Monthly",0]
["Scrap","1107","MB-STE-0239","Chicago Cupola cast scrap consumer buying price $/gross ton","USD","gross ton","Monthly",0]
["Scrap","1108","MB-STE-0240","Chicago Clean auto cast scrap consumer buying price $/gross ton","USD","gross ton","Monthly",0]
["Scrap","1109","MB-STE-0241","Chicago Unstripped motor blocks scrap consumer buying price $/gross ton","USD","gross ton","Monthly",0]
["Scrap","1110","MB-STE-0242","Chicago Heavy breakable cast scrap consumer buying price $/gross ton","USD","gross ton","Monthly",0]
["Scrap","1111","MB-STE-0243","Chicago Drop broken machinery cast, consumer buying price $/gross ton","USD","gross ton","Monthly",0]
["Scrap","1112","MB-STE-0244","Chicago Rail crops 2ft. max. scrap consumer buying price $/gross ton","USD","gross ton","Monthly",0]
["Scrap","1113","MB-STE-0245","Chicago Random rails scrap consumer buying price $/gross ton","USD","gross ton","Monthly",0]
["Scrap","1114","MB-STE-0246","Chicago Steel car wheels, consumer buying price $/gross ton","USD","gross ton","Monthly",0]
["Scrap","1115","MB-STE-0247","Chicago Rerolling rails, consumer buying price $/gross ton","USD","gross ton","Monthly",0]
["Scrap","1116","MB-STE-0248","Chicago Steel (tin) can bundles scrap consumer buying price $/gross ton","USD","gross ton","Monthly",0]
["Scrap","1117","MB-STE-0249","Cincinnati No. 1 heavy melt scrap consumer buying price $/gross ton","USD","gross ton","Monthly",0]
["Scrap","1118","MB-STE-0250","Cincinnati No. 1 bundles scrap consumer buying price $/gross ton","USD","gross ton","Monthly",0]
["Scrap","1119","MB-STE-0251","Cincinnati No. 1 busheling scrap consumer buying price $/gross ton","USD","gross ton","Monthly",0]
["Scrap","1120","MB-STE-0252","Cincinnati Shredded auto scrap consumer buying price $/gross ton","USD","gross ton","Monthly",0]
["Scrap","1121","MB-STE-0253","Cincinnati Machine shop turnings scrap consumer buying price $/gross ton","USD","gross ton","Monthly",0]
["Scrap","1122","MB-STE-0254","Cincinnati Cut structural/plate 5ft. max. scrap consumer buying price $/gross ton","USD","gross ton","Monthly",0]
["Scrap","1123","MB-STE-0255","Cleveland No. 1 heavy melt scrap consumer buying price $/gross ton","USD","gross ton","Monthly",0]
["Scrap","1124","MB-STE-0256","Cleveland No. 1 bundles scrap consumer buying price $/gross ton","USD","gross ton","Monthly",0]
["Scrap","1125","MB-STE-0257","Cleveland No. 1 busheling scrap consumer buying price $/gross ton","USD","gross ton","Monthly",0]
["Scrap","1126","MB-STE-0258","Cleveland Shredded auto scrap consumer buying price $/gross ton","USD","gross ton","Monthly",0]
["Scrap","1127","MB-STE-0259","Cleveland Machine shop turnings scrap consumer buying price $/gross ton","USD","gross ton","Monthly",0]
["Scrap","1128","MB-STE-0260","Cleveland Cut structural/plate 5ft. max. scrap consumer buying price $/gross ton","USD","gross ton","Monthly",0]
["Scrap","1129","MB-STE-0261","Cleveland Foundry steel 2ft. max. scrap consumer buying price $/gross ton","USD","gross ton","Monthly",0]
["Scrap","1130","MB-STE-0262","Cleveland Cupola cast scrap consumer buying price $/gross ton","USD","gross ton","Monthly",0]
["Scrap","1131","MB-STE-0263","Cleveland Clean auto cast scrap consumer buying price $/gross ton","USD","gross ton","Monthly",0]
["Scrap","1132","MB-STE-0264","Cleveland Unstripped motor blocks scrap consumer buying price $/gross ton","USD","gross ton","Monthly",0]
["Scrap","1133","MB-STE-0265","Cleveland Heavy breakable cast scrap consumer buying price $/gross ton","USD","gross ton","Monthly",0]
["Scrap","1134","MB-STE-0266","Cleveland Drop broken machinery cast, consumer buying price $/gross ton","USD","gross ton","Monthly",0]
["Scrap","1135","MB-STE-0267","Cleveland Rail crops 2ft. max. scrap consumer buying price $/gross ton","USD","gross ton","Monthly",0]
["Scrap","1136","MB-STE-0268","Cleveland Steel car wheels, consumer buying price $/gross ton","USD","gross ton","Monthly",0]
["Scrap","1137","MB-STE-0269","Cleveland Steel (tin) can bundles scrap consumer buying price $/gross ton","USD","gross ton","Monthly",0]
["Scrap","1138","MB-STE-0270","Detroit No. 1 heavy melt scrap consumer buying price $/gross ton","USD","gross ton","Monthly",0]
["Scrap","1139","MB-STE-0271","Detroit No. 1 bundles scrap consumer buying price $/gross ton","USD","gross ton","Monthly",0]
["Scrap","1140","MB-STE-0272","Detroit No. 1 busheling scrap consumer buying price $/gross ton","USD","gross ton","Monthly",0]
["Scrap","1141","MB-STE-0273","Detroit Shredded auto scrap consumer buying price $/gross ton","USD","gross ton","Monthly",0]
["Scrap","1142","MB-STE-0274","Detroit Machine shop turnings scrap consumer buying price $/gross ton","USD","gross ton","Monthly",0]
["Scrap","1143","MB-STE-0275","Detroit Cut structural/plate 5ft. max. scrap consumer buying price $/gross ton","USD","gross ton","Monthly",0]
["Scrap","1144","MB-STE-0276","Detroit Foundry steel 2ft. max. scrap consumer buying price $/gross ton","USD","gross ton","Monthly",0]
["Scrap","1145","MB-STE-0277","Detroit Cupola cast scrap consumer buying price $/gross ton","USD","gross ton","Monthly",0]
["Scrap","1146","MB-STE-0278","Detroit Clean auto cast scrap consumer buying price $/gross ton","USD","gross ton","Monthly",0]
["Scrap","1147","MB-STE-0279","Detroit Steel (tin) can bundles scrap consumer buying price $/gross ton","USD","gross ton","Monthly",0]
["Scrap","1148","MB-STE-0280","North Carolina/Virginia No. 1 heavy melt scrap consumer buying price $/gross ton","USD","gross ton","Monthly",0]
["Scrap","1149","MB-STE-0281","North Carolina/Virginia No. 1 busheling scrap consumer buying price $/gross ton","USD","gross ton","Monthly",0]
["Scrap","1150","MB-STE-0282","North Carolina/Virginia Shredded auto scrap consumer buying price $/gross ton","USD","gross ton","Monthly",0]
["Scrap","1151","MB-STE-0283","North Carolina/Virginia Machine shop turnings scrap consumer buying price $/gross ton","USD","gross ton","Monthly",0]
["Scrap","1152","MB-STE-0284","North Carolina/Virginia Cut structural/plate 5ft. max. scrap consumer buying price $/gross ton","USD","gross ton","Monthly",0]
["Scrap","1153","MB-STE-0285","Philadelphia No. 1 heavy melt scrap consumer buying price $/gross ton","USD","gross ton","Monthly",0]
["Scrap","1154","MB-STE-0286","Philadelphia No. 1 bundles scrap consumer buying price $/gross ton","USD","gross ton","Monthly",0]
["Scrap","1155","MB-STE-0287","Philadelphia No. 2 bundles scrap consumer buying price $/gross ton","USD","gross ton","Monthly",0]
["Scrap","1156","MB-STE-0288","Philadelphia No. 1 busheling scrap consumer buying price $/gross ton","USD","gross ton","Monthly",0]
["Scrap","1157","MB-STE-0289","Philadelphia Shredded auto scrap consumer buying price $/gross ton","USD","gross ton","Monthly",0]
["Scrap","1158","MB-STE-0290","Philadelphia Machine shop turnings scrap consumer buying price $/gross ton","USD","gross ton","Monthly",0]
["Scrap","1159","MB-STE-0291","Philadelphia Cut structural/plate 2ft. max. scrap consumer buying price $/gross ton","USD","gross ton","Monthly",0]
["Scrap","1160","MB-STE-0292","Philadelphia Cut structural/plate 3ft. max. scrap consumer buying price $/gross ton","USD","gross ton","Monthly",0]
["Scrap","1161","MB-STE-0293","Philadelphia Cut structural/plate 5ft. max. scrap consumer buying price $/gross ton","USD","gross ton","Monthly",0]
["Scrap","1162","MB-STE-0294","Philadelphia Foundry steel 2ft. max. scrap consumer buying price $/gross ton","USD","gross ton","Monthly",0]
["Scrap","1163","MB-STE-0295","Philadelphia Cupola cast scrap consumer buying price $/gross ton","USD","gross ton","Monthly",0]
["Scrap","1164","MB-STE-0296","Philadelphia Clean auto cast scrap consumer buying price $/gross ton","USD","gross ton","Monthly",0]
["Scrap","1165","MB-STE-0297","Philadelphia Unstripped motor blocks scrap consumer buying price $/gross ton","USD","gross ton","Monthly",0]
["Scrap","1166","MB-STE-0298","Philadelphia Heavy breakable cast scrap consumer buying price $/gross ton","USD","gross ton","Monthly",0]
["Scrap","1167","MB-STE-0299","Philadelphia Drop broken machinery cast scrap consumer buying price $/gross ton","USD","gross ton","Monthly",0]
["Scrap","1168","MB-STE-0300","Philadelphia Rail crops 2ft. max. scrap consumer buying price $/gross ton","USD","gross ton","Monthly",0]
["Scrap","1169","MB-STE-0301","Philadelphia Random rails scrap consumer buying price $/gross ton","USD","gross ton","Monthly",0]
["Scrap","1171","MB-STE-0303","Pittsburgh No. 1 heavy melt scrap consumer buying price $/gross ton","USD","gross ton","Monthly",0]
["Scrap","1172","MB-STE-0304","Pittsburgh No. 1 bundles scrap consumer buying price $/gross ton","USD","gross ton","Monthly",0]
["Scrap","1173","MB-STE-0305","Pittsburgh No. 2 bundles scrap consumer buying price $/gross ton","USD","gross ton","Monthly",0]
["Scrap","1174","MB-STE-0306","Pittsburgh No. 1 busheling scrap consumer buying price $/gross ton","USD","gross ton","Monthly",0]
["Scrap","1175","MB-STE-0307","Pittsburgh No. 1 industrial bundles, consumer buying price $/gross ton","USD","gross ton","Monthly",0]
["Scrap","1176","MB-STE-0308","Pittsburgh Shredded auto scrap consumer buying price $/gross ton","USD","gross ton","Monthly",0]
["Scrap","1177","MB-STE-0309","Pittsburgh Machine shop turnings scrap consumer buying price $/gross ton","USD","gross ton","Monthly",0]
["Scrap","1178","MB-STE-0310","Pittsburgh Cast iron borings scrap consumer buying price $/gross ton","USD","gross ton","Monthly",0]
["Scrap","1179","MB-STE-0311","Pittsburgh Cut structural/plate 3ft. max. scrap consumer buying price $/gross ton","USD","gross ton","Monthly",0]
["Scrap","1180","MB-STE-0312","Pittsburgh Cut structural/plate 5ft. max. scrap consumer buying price $/gross ton","USD","gross ton","Monthly",0]
["Scrap","1181","MB-STE-0313","Pittsburgh Foundry steel 2ft. max. scrap consumer buying price $/gross ton","USD","gross ton","Monthly",0]
["Scrap","1182","MB-STE-0314","Pittsburgh Cupola cast scrap consumer buying price $/gross ton","USD","gross ton","Monthly",0]
["Scrap","1183","MB-STE-0315","Pittsburgh Clean auto cast scrap consumer buying price $/gross ton","USD","gross ton","Monthly",0]
["Scrap","1184","MB-STE-0316","Pittsburgh Unstripped motor blocks scrap consumer buying price $/gross ton","USD","gross ton","Monthly",0]
["Scrap","1185","MB-STE-0317","Pittsburgh Heavy breakable cast scrap consumer buying price $/gross ton","USD","gross ton","Monthly",0]
["Scrap","1186","MB-STE-0318","Pittsburgh Rail crops 2ft. max. scrap consumer buying price $/gross ton","USD","gross ton","Monthly",0]
["Scrap","1187","MB-STE-0319","Pittsburgh Random rails scrap consumer buying price $/gross ton","USD","gross ton","Monthly",0]
["Scrap","1189","MB-STE-0321","Pittsburgh Steel (tin) can bundles scrap consumer buying price $/gross ton","USD","gross ton","Monthly",0]
["Scrap","1190","MB-STE-0322","South Carolina No. 1 heavy melt scrap consumer buying price $/gross ton","USD","gross ton","Monthly",0]
["Scrap","1191","MB-STE-0323","South Carolina No. 1 busheling scrap consumer buying price $/gross ton","USD","gross ton","Monthly",0]
["Scrap","1192","MB-STE-0324","South Carolina Shredded auto scrap consumer buying price $/gross ton","USD","gross ton","Monthly",0]
["Scrap","1193","MB-STE-0325","South Carolina Machine shop turnings scrap consumer buying price $/gross ton","USD","gross ton","Monthly",0]
["Scrap","1194","MB-STE-0326","South Carolina Cut structural/plate 5ft. max. scrap consumer buying price $/gross ton","USD","gross ton","Monthly",0]
["Scrap","1195","MB-STE-0327","Youngstown No. 1 heavy melt scrap consumer buying price $/gross ton","USD","gross ton","Monthly",0]
["Scrap","1196","MB-STE-0328","Youngstown No. 2 bundles scrap consumer scrap buying price $/gross ton","USD","gross ton","Monthly",0]
["Scrap","1197","MB-STE-0329","Youngstown No. 1 busheling scrap consumer buying price $/gross ton","USD","gross ton","Monthly",0]
["Scrap","1198","MB-STE-0330","Youngstown Shredded auto scrap consumer buying price $/gross ton","USD","gross ton","Monthly",0]
["Scrap","1199","MB-STE-0331","Youngstown Cut structural/plate 5ft. max. scrap consumer buying price $/gross ton","USD","gross ton","Monthly",0]
["Scrap","12","MB-AL-0011","Aluminium Scrap, Commercial Pure Cuttings, United Kingdom, delivered consumer works, £ per tonne","GBP","tonne","Weekly",0]
["Scrap","1200","MB-STE-0332","Youngstown Foundry steel 2ft. max. scrap consumer buying price $/gross ton","USD","gross ton","Monthly",0]
["Scrap","1201","MB-STE-0333","Hamilton, Ontario No. 1 heavy melt scrap consumer buying price Canadian $/ net ton","CAD","net ton","Monthly",0]
["Scrap","1202","MB-STE-0334","Hamilton, Ontario No. 1 bundles scrap consumer buying price Canadian $/ net ton","CAD","net ton","Monthly",0]
["Scrap","1203","MB-STE-0335","Hamilton, Ontario No. 1 busheling scrap consumer buying price Canadian $/ net ton","CAD","net ton","Monthly",0]
["Scrap","1204","MB-STE-0336","Hamilton, Ontario Shredded auto scrap consumer buying price Canadian $/ net ton","CAD","net ton","Monthly",0]
["Scrap","1205","MB-STE-0337","Hamilton, Ontario Cut structural/plate 5ft. max. scrap consumer buying price Canadian $/ net ton","CAD","net ton","Monthly",0]
["Scrap","1210","MB-STS-0040","Pittsburgh 316 solids, clips stainless steel scrap dealer buying price cents/lb","US Cents","pound","Weekly",0]
["Scrap","1211","MB-STS-0041","Pittsburgh 304 solids, clips stainless steel scrap dealerbuying price cents/lb","US Cents","pound","Weekly",0]
["Scrap","1212","MB-STS-0042","Pittsburgh 304 turnings stainless steel scrap dealer buying price cents/lb","US Cents","pound","Weekly",0]
["Scrap","1213","MB-STS-0043","Pittsburgh 304 new clips stainless steel scrap dealer buying price cents/lb","US Cents","pound","Weekly",0]
["Scrap","1214","MB-STS-0044","Pittsburgh 430 new clips stainless steel scrap dealer buying price cents/lb","US Cents","pound","Weekly",0]
["Scrap","1215","MB-STS-0045","Pittsburgh 316 solids, clips stainless steel scrap broker buying $/gross ton","USD","gross ton","Weekly",0]
["Scrap","1216","MB-STS-0046","Pittsburgh 304 solids, clips stainless steel scrapbroker buying $/gross ton","USD","gross ton","Weekly",0]
["Scrap","1217","MB-STS-0047","Pittsburgh 304 turnings stainless steel scrap broker buying $/gross ton","USD","gross ton","Weekly",0]
["Scrap","1218","MB-STS-0048","Pittsburgh 430 bundles, solids stainless steel scrap broker buying $/gross ton","USD","gross ton","Weekly",0]
["Scrap","1219","MB-STS-0049","Pittsburgh 430 turnings, stainless steel scrap broker buying $/gross ton","USD","gross ton","Weekly",0]
["Scrap","1220","MB-STS-0050","Pittsburgh 409 bundles, solids stainless steel scrap broker buying $/gross ton","USD","gross ton","Weekly",0]
["Scrap","1221","MB-STS-0051","Pittsburgh 409 turnings scrap broker buying $/gross ton","USD","gross ton","Weekly",0]
["Scrap","1222","MB-STS-0052","Boston 316 solids, clips dealer buying price cents/lb","US Cents","pound","Weekly",0]
["Scrap","1223","MB-STS-0053","Boston 304 solids, clips stainless steel scrap dealerbuying price cents/lb","US Cents","pound","Weekly",0]
["Scrap","1224","MB-STS-0054","Boston 304 turnings stainless steel scrap dealer buying price cents/lb","US Cents","pound","Weekly",0]
["Scrap","1225","MB-STS-0055","Boston 430 new clips stainless steel scrap dealer buying price cents/lb","US Cents","pound","Weekly",0]
["Scrap","1226","MB-STS-0056","Boston 430 bundles, solids export yard buying price $/gross ton","USD","gross ton","Weekly",0]
["Scrap","1231","MB-STS-0061","Chicago 316 solids, clips dealer buying price cents/lb","US Cents","pound","Weekly",0]
["Scrap","1232","MB-STS-0062","Chicago 304 solids, clips stainless steel scrap dealerbuying price cents/lb","US Cents","pound","Weekly",0]
["Scrap","1233","MB-STS-0063","Chicago 304 turnings stainless steel scrap dealer buying price cents/lb","US Cents","pound","Weekly",0]
["Scrap","1234","MB-STS-0064","Chicago 304 new clips dealer buying price cents/lb","US Cents","pound","Weekly",0]
["Scrap","1235","MB-STS-0065","Chicago 430 new clips stainless steel scrap dealer buying price cents/lb","US Cents","pound","Weekly",0]
["Scrap","1236","MB-STS-0066","Chicago 316 solids, clips, broker buying $/gross ton","USD","gross ton","Weekly",0]
["Scrap","1237","MB-STS-0067","Chicago 304 solids, clips, broker buying $/gross ton","USD","gross ton","Weekly",0]
["Scrap","1238","MB-STS-0068","Chicago 304 turnings, broker buying $/gross ton","USD","gross ton","Weekly",0]
["Scrap","1239","MB-STS-0069","Chicago 430 bundles, solids broker buying $/gross ton","USD","gross ton","Weekly",0]
["Scrap","1240","MB-STS-0070","Chicago 430 turnings, broker buying $/gross ton","USD","gross ton","Weekly",0]
["Scrap","1241","MB-STS-0071","Chicago 409 bundles, solids stainless steel scrap broker buying $/gross ton","USD","gross ton","Weekly",0]
["Scrap","1242","MB-STS-0072","Chicago 409 turnings scrap broker buying $/gross ton","USD","gross ton","Weekly",0]
["Scrap","1243","MB-STS-0073","Cleveland 316 solids, clips dealer buying price cents/lb","US Cents","pound","Weekly",0]
["Scrap","1244","MB-STS-0074","Cleveland 304 solids, clips stainless steel scrap dealerbuying price cents/lb","US Cents","pound","Weekly",0]
["Scrap","1245","MB-STS-0075","Cleveland 304 turnings stainless steel scrap dealer buying price cents/lb","US Cents","pound","Weekly",0]
["Scrap","1246","MB-STS-0076","Cleveland 304 new clips dealer buying price cents/lb","US Cents","pound","Weekly",0]
["Scrap","1247","MB-STS-0077","Cleveland 430 new clips stainless steel scrap dealer buying price cents/lb","US Cents","pound","Weekly",0]
["Scrap","1248","MB-STS-0078","Cleveland 316 solids, clips, broker buying $/gross ton","USD","gross ton","Weekly",0]
["Scrap","1249","MB-STS-0079","Cleveland 304 solids, clips, broker buying $/gross ton","USD","gross ton","Weekly",0]
["Scrap","1250","MB-STS-0080","Cleveland 304 turnings, broker buying $/gross ton","USD","gross ton","Weekly",0]
["Scrap","1251","MB-STS-0081","Detroit 316 solids, clips dealer buying price cents/lb","US Cents","pound","Weekly",0]
["Scrap","1252","MB-STS-0082","Detroit 304 solids, clips stainless steel scrap dealerbuying price cents/lb","US Cents","pound","Weekly",0]
["Scrap","1253","MB-STS-0083","Detroit 304 turnings stainless steel scrap dealer buying price cents/lb","US Cents","pound","Weekly",0]
["Scrap","1254","MB-STS-0084","Detroit 304 new clips dealer buying price cents/lb","US Cents","pound","Weekly",0]
["Scrap","1255","MB-STS-0085","Detroit 430 new clips stainless steel scrap dealer buying price cents/lb","US Cents","pound","Weekly",0]
["Scrap","1256","MB-STS-0086","Detroit 316 solids, clips, broker buying $/gross ton","USD","gross ton","Weekly",0]
["Scrap","1257","MB-STS-0087","Detroit 304 solids, clips, broker buying $/gross ton","USD","gross ton","Weekly",0]
["Scrap","1258","MB-STS-0088","Detroit 304 turnings, broker buying $/gross ton","USD","gross ton","Weekly",0]
["Scrap","1259","MB-STS-0089","Detroit 430 bundles, solids, broker buying $/gross ton","USD","gross ton","Weekly",0]
["Scrap","1260","MB-STS-0090","Detroit 409 bundles, solids stainless steel scrap, broker buying $/gross ton","USD","gross ton","Weekly",0]
["Scrap","1261","MB-STS-0091","Detroit 409 turnings scrap broker buying $/gross ton","USD","gross ton","Weekly",0]
["Scrap","1262","MB-STS-0092","Houston 316 solids, clips dealer buying price cents/lb","US Cents","pound","Weekly",0]
["Scrap","1263","MB-STS-0093","Houston 304 solids, clips stainless steel scrap dealerbuying price cents/lb","US Cents","pound","Weekly",0]
["Scrap","1264","MB-STS-0094","Houston 304 turnings stainless steel scrap dealer buying price cents/lb","US Cents","pound","Weekly",0]
["Scrap","1265","MB-STS-0095","Houston 316 solids, clips, broker buying $/gross ton","USD","gross ton","Weekly",0]
["Scrap","1266","MB-STS-0096","Houston 304 solids, clips, broker buying $/gross ton","USD","gross ton","Weekly",0]
["Scrap","1267","MB-STS-0097","Houston 304 turnings, broker buying $/gross ton","USD","gross ton","Weekly",0]
["Scrap","1268","MB-STS-0098","Houston 430 bundles, solids, broker buying $/gross ton","USD","gross ton","Weekly",0]
["Scrap","1269","MB-STS-0099","Houston 409 bundles, solids stainless steel scrap, broker buying $/gross ton","USD","gross ton","Weekly",0]
["Scrap","1270","MB-STS-0100","Los Angeles 316 solids, clips dealer buying price cents/lb","US Cents","pound","Weekly",0]
["Scrap","1271","MB-STS-0101","Los Angeles 304 solids, clips stainless steel scrap dealerbuying price cents/lb","US Cents","pound","Weekly",0]
["Scrap","1272","MB-STS-0102","Los Angeles 304 turnings stainless steel scrap dealer buying price cents/lb","US Cents","pound","Weekly",0]
["Scrap","1273","MB-STS-0103","Los Angeles 304 new clips dealer buying price cents/lb","US Cents","pound","Weekly",0]
["Scrap","1274","MB-STS-0104","Los Angeles 304 solids, clips, export yard buying price $/gross ton","USD","gross ton","Weekly",0]
["Scrap","1275","MB-STS-0105","Los Angeles 304 turnings export yard buying price $/gross ton","USD","gross ton","Weekly",0]
["Scrap","1276","MB-STS-0106","Los Angeles 430 bundles, solids, export yard buying price $/gross ton","USD","gross ton","Weekly",0]
["Scrap","1277","MB-STS-0107","New York 316 solids, clips dealer buying price cents/lb","US Cents","pound","Weekly",0]
["Scrap","1278","MB-STS-0108","New York 304 solids, clips stainless steel scrap dealerbuying price cents/lb","US Cents","pound","Weekly",0]
["Scrap","1279","MB-STS-0109","New York 304 turnings stainless steel scrap dealer buying price cents/lb","US Cents","pound","Weekly",0]
["Scrap","1280","MB-STS-0110","New York 304 new clips stainless steel scrap dealer buying price cents/lb","US Cents","pound","Weekly",0]
["Scrap","1281","MB-STS-0111","New York 430 new clips stainless steel scrap dealer buying price cents/lb","US Cents","pound","Weekly",0]
["Scrap","1282","MB-STS-0112","New York 316 solids clips stainless steel scrap broker buying $/gross ton","USD","gross ton","Weekly",0]
["Scrap","1283","MB-STS-0113","New York 304 solids clips stainless steel scrap broker buying $/gross ton","USD","gross ton","Weekly",0]
["Scrap","1284","MB-STS-0114","New York 304 turnings stainless steel scrap broker buying $/gross ton","USD","gross ton","Weekly",0]
["Scrap","1285","MB-STS-0115","New York 304 solids, clips, export yard stainless steel scrap buying price $/gross ton","USD","gross ton","Weekly",0]
["Scrap","1286","MB-STS-0116","New York 304 turnings stainless steel scrap export yard buying price $/gross ton","USD","gross ton","Weekly",0]
["Scrap","1287","MB-STS-0117","New York 430 bundles solids stainless steel scrap export yard buying price $/gross ton","USD","gross ton","Weekly",0]
["Scrap","1288","MB-STS-0118","Philadelphia 304 solids clips stainless steel scrap export yard buying price $/gross ton","USD","gross ton","Weekly",0]
["Scrap","1289","MB-STS-0119","Philadelphia 304 turnings stainless steel scrap export yard buying price $/gross ton","USD","gross ton","Weekly",0]
["Scrap","1290","MB-STS-0120","Philadelphia 430 bundles solids stainless steel scrap export yard buying price $/gross ton","USD","gross ton","Weekly",0]
["Scrap","1291","MB-STS-0121","San Francisco 316 solids, clips stainless steel scrap dealer buying price cents/lb","US Cents","pound","Weekly",0]
["Scrap","1292","MB-STS-0122","San Francisco 304 solids, clips stainless steel scrap dealerbuying price cents/lb","US Cents","pound","Weekly",0]
["Scrap","1293","MB-STS-0123","San Francisco 304 turnings stainless steel scrap dealer buying price cents/lb","US Cents","pound","Weekly",0]
["Scrap","1294","MB-STS-0124","San Francisco 304 new clips stainless steel scrap dealer buying price cents/lb","US Cents","pound","Weekly",0]
["Scrap","1295","MB-STS-0125","San Francisco 304 solids clips stainless steel scrap export yard buying price $/gross ton","USD","gross ton","Weekly",0]
["Scrap","1296","MB-STS-0126","San Francisco 304 turnings export yard buying price $/gross ton","USD","gross ton","Weekly",0]
["Scrap","1297","MB-STS-0127","San Francisco 430 bundles solids stainless steel scrap export yard buying price $/gross ton","USD","gross ton","Weekly",0]
["Scrap","1298","MB-STS-0128","Montreal 316 solids clips stainless steel scrap dealer buying price Canadian cents/lb","CA Cents","pound","Weekly",0]
["Scrap","1299","MB-STS-0129","Montreal 304 solids clips stainless steel scrap dealerbuying price Canadian cents/lb","CA Cents","pound","Weekly",0]
["Scrap","13","MB-AL-0012","Aluminium Scrap, Commercial turnings, United Kingdom, delivered consumer works, £ per tonne","GBP","tonne","Weekly",0]
["Scrap","1300","MB-STS-0130","Montreal 304 turnings stainless steel scrap dealer buying price Canadian cents/lb","CA Cents","pound","Weekly",0]
["Scrap","1301","MB-STS-0131","Montreal 304 new clips stainless steel scrap dealer buying price Canadian cents/lb","CA Cents","pound","Weekly",0]
["Scrap","1302","MB-STE-0340","Atlanta No. 1 heavy melt scrap dealer selling price $/gross ton","USD","gross ton","Monthly",0]
["Scrap","1303","MB-STE-0341","Atlanta No. 1 busheling scrap dealer selling price $/gross ton","USD","gross ton","Monthly",0]
["Scrap","1304","MB-STE-0342","Atlanta Shredded auto scrap dealer selling price $/gross ton","USD","gross ton","Monthly",0]
["Scrap","1305","MB-STE-0343","Atlanta Machine shop turnings scrap dealer selling price $/gross ton","USD","gross ton","Monthly",0]
["Scrap","1306","MB-STE-0344","Atlanta Cut structural/plate 5ft. max. scrap dealer selling price $/gross ton","USD","gross ton","Monthly",0]
["Scrap","1312","MB-STE-0350","Houston No. 1 heavy melt scrap dealer selling price $/gross ton","USD","gross ton","Monthly",0]
["Scrap","1313","MB-STE-0351","Houston No. 1 busheling scrap dealer selling price $/gross ton","USD","gross ton","Monthly",0]
["Scrap","1314","MB-STE-0352","Houston Shredded auto scrap dealer selling price $/gross ton","USD","gross ton","Monthly",0]
["Scrap","1315","MB-STE-0353","Houston Machine shop turnings dealer selling price $/gross ton","USD","gross ton","Monthly",0]
["Scrap","1316","MB-STE-0354","Houston Cut structural/plate 5ft. max. dealer selling price $/gross ton","USD","gross ton","Monthly",0]
["Scrap","1317","MB-STE-0355","St. Louis No. 1 heavy melt scrap dealer selling price $/gross ton","USD","gross ton","Monthly",0]
["Scrap","1318","MB-STE-0356","St. Louis No. 1 bundles dealer selling price $/gross ton","USD","gross ton","Monthly",0]
["Scrap","1319","MB-STE-0357","St. Louis No. 1 busheling scrap dealer selling price $/gross ton","USD","gross ton","Monthly",0]
["Scrap","1320","MB-STE-0358","St. Louis Shredded auto scrap dealer selling price $/gross ton","USD","gross ton","Monthly",0]
["Scrap","1321","MB-STE-0359","St. Louis Machine shop turnings dealer selling price $/gross ton","USD","gross ton","Monthly",0]
["Scrap","1322","MB-STE-0360","St. Louis Cut structural/plate 5ft. max. dealer selling price $/gross ton","USD","gross ton","Monthly",0]
["Scrap","1323","MB-STE-0361","Montreal No. 1 heavy melt scrap dealer selling price Canadian $/net ton","CAD","net ton","Monthly",0]
["Scrap","1324","MB-STE-0362","Montreal No. 1 busheling scrap dealer selling price Canadian $/net ton","CAD","net ton","Monthly",0]
["Scrap","1325","MB-STE-0363","Montreal Shredded auto scrap dealer selling price Canadian $/net ton","CAD","net ton","Monthly",0]
["Scrap","1326","MB-STE-0364","Montreal Machine shop turnings dealer selling price Canadian $/net ton","CAD","net ton","Monthly",0]
["Scrap","1327","MB-STE-0365","Montreal Cut structural/plate 5ft. max. dealer selling price Canadian $/net ton","CAD","net ton","Monthly",0]
["Scrap","1328","MB-STE-0366","Boston No. 1 heavy melt scrap export yard buying price $/gross ton","USD","gross ton","Monthly",0]
["Scrap","1329","MB-STE-0367","Boston No. 2 bundles export yard buying price $/gross ton","USD","gross ton","Monthly",0]
["Scrap","1330","MB-STE-0368","Boston Mixed cast export yard buying price $/gross ton","USD","gross ton","Monthly",0]
["Scrap","1331","MB-STE-0369","Boston Unstripped motor blocks scrap export yard buying price $/gross ton","USD","gross ton","Monthly",0]
["Scrap","1332","MB-STE-0370","Boston Auto bodies export yard buying price $/gross ton","USD","gross ton","Monthly",0]
["Scrap","1333","MB-STE-0371","Boston Cut structural/plate 5ft. max. scrap export yard buying price $/gross ton","USD","gross ton","Monthly",0]
["Scrap","1334","MB-STE-0372","Los Angeles No. 1 heavy melt scrap export yard buying price $/gross ton","USD","gross ton","Monthly",0]
["Scrap","1335","MB-STE-0373","Los Angeles No. 2 bundles export yard buying price $/gross ton","USD","gross ton","Monthly",0]
["Scrap","1336","MB-STE-0374","Los Angeles No. 1 busheling scrap export yard buying price $/gross ton","USD","gross ton","Monthly",0]
["Scrap","1337","MB-STE-0375","Los Angeles Machine shop turnings export yard buying price $/gross ton","USD","gross ton","Monthly",0]
["Scrap","1338","MB-STE-0376","Los Angeles Unstripped motor blocks scrap export yard buying price $/gross ton","USD","gross ton","Monthly",0]
["Scrap","1339","MB-STE-0377","Los Angeles Auto bodies export yard buying price $/gross ton","USD","gross ton","Monthly",0]
["Scrap","1340","MB-STE-0378","Los Angeles Cut structural/plate 5ft. max. scrap export yard buying price $/gross ton","USD","gross ton","Monthly",0]
["Scrap","1341","MB-STE-0379","New York No. 1 heavy melt scrap export yard buying price $/gross ton","USD","gross ton","Monthly",0]
["Scrap","1342","MB-STE-0380","New York No. 2 bundles export yard buying price $/gross ton","USD","gross ton","Monthly",0]
["Scrap","1343","MB-STE-0381","New York Machine shop turnings export yard buying price $/gross ton","USD","gross ton","Monthly",0]
["Scrap","1344","MB-STE-0382","New York Mixed cast export yard buying price $/gross ton","USD","gross ton","Monthly",0]
["Scrap","1345","MB-STE-0383","New York Unstripped motor blocks scrap export yard buying price $/gross ton","USD","gross ton","Monthly",0]
["Scrap","1346","MB-STE-0384","New York Auto bodies export yard buying price $/gross ton","USD","gross ton","Monthly",0]
["Scrap","1347","MB-STE-0385","New York Cut structural/plate 5ft. max. scrap export yard buying price $/gross ton","USD","gross ton","Monthly",0]
["Scrap","1348","MB-STE-0386","Philadelphia No. 1 heavy melt scrap export yard buying price $/gross ton","USD","gross ton","Monthly",0]
["Scrap","1349","MB-STE-0387","Philadelphia No. 2 bundles export yard buying price $/gross ton","USD","gross ton","Monthly",0]
["Scrap","1350","MB-STE-0388","Philadelphia Mixed cast export yard buying price $/gross ton","USD","gross ton","Monthly",0]
["Scrap","1351","MB-STE-0389","Philadelphia Unstripped motor blocks scrap export yard buying price $/gross ton","USD","gross ton","Monthly",0]
["Scrap","1352","MB-STE-0390","Philadelphia Auto bodies export yard buying price $/gross ton","USD","gross ton","Monthly",0]
["Scrap","1353","MB-STE-0391","Philadelphia Cut structural/plate 5ft. max. scrap export yard buying price $/gross ton","USD","gross ton","Monthly",0]
["Scrap","1354","MB-STE-0392","San Francisco No. 1 heavy melt scrap export yard buying price $/gross ton","USD","gross ton","Monthly",0]
["Scrap","1355","MB-STE-0393","San Francisco No. 2 bundles export yard buying price $/gross ton","USD","gross ton","Monthly",0]
["Scrap","1356","MB-STE-0394","San Francisco No. 1 busheling scrap export yard buying price $/gross ton","USD","gross ton","Monthly",0]
["Scrap","1357","MB-STE-0395","San Francisco Machine shop turnings export yard buying price $/gross ton","USD","gross ton","Monthly",0]
["Scrap","1358","MB-STE-0396","San Francisco Unstripped motor blocks scrap export yard buying price $/gross ton","USD","gross ton","Monthly",0]
["Scrap","1359","MB-STE-0397","San Francisco Auto bodies scrap export yard buying price $/gross ton","USD","gross ton","Monthly",0]
["Scrap","1360","MB-STE-0398","San Francisco Cut structural/plate 5ft. max. scrap export yard buying price $/gross ton","USD","gross ton","Monthly",0]
["Scrap","1361","MB-STE-0399","Seattle/Portland No. 1 heavy melt scrap export yard buying price $/gross ton","USD","gross ton","Monthly",0]
["Scrap","1362","MB-STE-0400","Seattle/Portland Machine shop turnings scrap export yard buying price $/gross ton","USD","gross ton","Monthly",0]
["Scrap","1363","MB-STE-0401","Seattle/Portland Unstripped motor blocks scrap export yard buying price $/gross ton","USD","gross ton","Monthly",0]
["Scrap","1364","MB-STE-0402","Seattle/Portland Auto bodies scrap export yard buying price $/gross ton","USD","gross ton","Monthly",0]
["Scrap","1365","MB-STE-0403","Seattle/Portland Cut structural/plate 5ft. max. scrap, export yard buying price $/gross ton","USD","gross ton","Monthly",0]
["Scrap","1366","MB-STE-0404","Houston No. 1 heavy melt scrap consumer buying price trend $/gross ton","USD","gross ton","Monthly",0]
["Scrap","1367","MB-STE-0405","Houston No. 1 busheling scrap consumer buying price trend $/gross ton","USD","gross ton","Monthly",0]
["Scrap","1368","MB-STE-0406","Houston Shredded auto scrap consumer buying price trend $/gross ton","USD","gross ton","Monthly",0]
["Scrap","1369","MB-STE-0407","Houston Machine shop turnings scrap consumer buying price trend $/gross ton","USD","gross ton","Monthly",0]
["Scrap","1370","MB-STE-0408","Houston Cut structural/plate 5ft. max. scrap consumer buying price trend $/gross ton","USD","gross ton","Monthly",0]
["Scrap","1371","MB-STE-0409","Seattle/Portland No. 1 heavy melt scrap consumer buying price trend $/gross ton","USD","gross ton","Monthly",0]
["Scrap","1372","MB-STE-0410","Seattle/Portland Shredded auto scrap consumer buying price trend $/gross ton","USD","gross ton","Monthly",0]
["Scrap","1373","MB-STE-0411","Seattle/Portland Machine shop turnings consumer buying price trend $/gross ton","USD","gross ton","Monthly",0]
["Scrap","1374","MB-STE-0412","Seattle/Portland Cut structural/plate 5ft. max. consumer buying price trend $/gross ton","USD","gross ton","Monthly",0]
["Scrap","1376","MB-STS-0132","Pittsburgh 316 solids, clips consumer buying $/gross ton","USD","gross ton","Weekly",0]
["Scrap","1377","MB-STS-0133","Pittsburgh 304 solids clips consumer buying $/gross ton","USD","gross ton","Weekly",0]
["Scrap","1378","MB-STS-0134","Pittsburgh 304 turnings consumer buying $/gross ton","USD","gross ton","Weekly",0]
["Scrap","1379","MB-STS-0135","Pittsburgh 430 bundles, solids consumer buying $/gross ton","USD","gross ton","Weekly",0]
["Scrap","1380","MB-STS-0136","Pittsburgh 409 bundles, solids stainless steel scrap consumer buying $/gross ton","USD","gross ton","Weekly",0]
["Scrap","1381","MB-STE-0413","India import ferrous scrap HMS 1 & 2 (80:20 mix) cfr Nhava Sheva US $ per tonne","USD","tonne","Weekly",0]
["Scrap","1396","MB-STE-0416","HMS 1&2 (80:20 mix) North Europe origin US $ per tonne CFR Turkey","USD","tonne","Daily",0]
["Scrap","1398","MB-STE-0418","HMS 1&2 (80:20) East Coast FOB New York export index US $/tonne","USD","tonne","Monthly",0]
["Scrap","1399","MB-STE-0419","Shredded East Coast FOB New York export index US $/tonne","USD","tonne","Monthly",0]
["Scrap","14","MB-AL-0013","Aluminium Scrap, Floated Frag, Europe, del consumer works, € per tonne","EUR","tonne","Weekly",0]
["Scrap","1400","MB-STE-0420","HMS 1&2 (80:20 mix) US $ per tonne fob Rotterdam","USD","tonne","Daily",0]
["Scrap","1401","MB-STE-0421","Shredded scrap US $ per tonne CFR India","USD","tonne","Weekly",0]
["Scrap","1402","MB-STE-0422","No. 1 busheling US domestic Midwest Index $/gross ton","USD","gross ton","Monthly",0]
["Scrap","1403","MB-STE-0423","Shredded steel scrap US domestic Midwest Index $/gross ton","USD","gross ton","Monthly",0]
["Scrap","1404","MB-STE-0424","No. 1 heavy melt scrap US domestic Midwest Index $/gross ton","USD","gross ton","Monthly",0]
["Scrap","1405","MB-STE-0425","HMS 1&2 (80:20) West Coast FOB Los Angeles export index US $/tonne","USD","tonne","Monthly",0]
["Scrap","1415","MB-STE-0426","No. 1 heavy melt scrap daily composite $/gross ton","USD","gross ton","Monthly",0]
["Scrap","1416","MB-STE-0427","Shredded auto scrap daily composite $/gross ton","USD","gross ton","Monthly",0]
["Scrap","1417","MB-STE-0428","No. 1 busheling scrap daily composite $/gross ton","USD","gross ton","Monthly",0]
["Scrap","1419","MB-STE-0430","UK inter-merchant ferrous scrap 7B Heavy Steel Turnings £ per tonne delivered to export dock","GBP","tonne","Monthly",0]
["Scrap","1420","MB-STE-0431","UK domestic ferrous scrap 12 D new production clean shovellable steel £ per tonne del consumer","GBP","tonne","Monthly",0]
["Scrap","1421","MB-STE-0432","UK domestic ferrous scrap 12 A/C new production heavy steel £ per tonne del consumer","GBP","tonne","Monthly",0]
["Scrap","1486","MB-PT-0005","Buffalo Used beverage cans, clean & dry scrap dealer buying price delivered to yard cents/lb","US Cents","pound","twice monthly",0]
["Scrap","1487","MB-PD-0005","Buffalo Undrained Whole old batteries scrap dealer buying price delivered to yard cents/lb","US Cents","pound","twice monthly",0]
["Scrap","1488","MB-RH-0001","Buffalo Wheel weights scrap dealer buying price delivered to yard cents/lb","US Cents","pound","twice monthly",0]
["Scrap","1489","MB-IR-0001","Buffalo Shredded scrap broker buying price $/per gross ton","USD","gross ton","Weekly",0]
["Scrap","1490","MB-RU-0001","Buffalo Yellow brass rod ends scrap dealer buying price delivered to yard cents/lb","US Cents","pound","twice monthly",0]
["Scrap","1491","MB-STE-0464","Taiwan import ferrous scrap HMS 1&2 (80:20 mix) (USA material) $ per tonne cfr main port","USD","tonne","twice weekly",0]
["Scrap","15","MB-AL-0014","Aluminium Scrap, Group 1 Pure 99% & Litho, United Kingdom, delivered consumer works, £ per tonne","GBP","tonne","Weekly",0]
["Scrap","1501","MB-CU-0291","No. 1 copper discount copper scrap buying price delivered to brass mill cents/lb","US Cents","pound","Daily",0]
["Scrap","1502","MB-CU-0292","No. 1 copper discount copper scrap buying price delivered to refiners cents/lb","US Cents","pound","Daily",0]
["Scrap","1503","MB-CU-0293","No. 2 copper discount copper scrap buying price delivered to refiners cents/lb","US Cents","pound","Daily",0]
["Scrap","1504","MB-CU-0294","No. 1 bare bright discount copper scrap buying price delivered to brass ingot makers cents/lb","US Cents","pound","Daily",0]
["Scrap","1505","MB-CU-0295","No. 1 discount copper scrap buying price delivered to brass ingot makers cents/lb","US Cents","pound","Daily",0]
["Scrap","1506","MB-CU-0296","No. 2 discount copper scrap buying price delivered to brass ingot makers cents/lb","US Cents","pound","Daily",0]
["Scrap","1507","MB-CU-0297","Light Copper discount copper scrap buying price delivered to brass ingot makers cents/lb","US Cents","pound","Daily",0]
["Scrap","1508","MB-CU-0298","No. 1 comp. solids copper scrap buying price delivered to brass ingot makers cents/lb","US Cents","pound","Daily",0]
["Scrap","1509","MB-CU-0299","Comp., borings, turnings copper scrap buying price delivered to brass ingot makers cents/lb","US Cents","pound","Daily",0]
["Scrap","1510","MB-CU-0300","Radiators copper scrap buying price delivered to brass ingot makers cents/lb","US Cents","pound","Daily",0]
["Scrap","1511","MB-CU-0301","Yellow brass solids copper scrap buying price delivered to brass ingot makers cents/lb","US Cents","pound","Daily",0]
["Scrap","1512","MB-CU-0302","No. 1 copper scrap buying price delivered to brass mill cents/lb","US Cents","pound","Daily",0]
["Scrap","1513","MB-CU-0303","No. 1 copper scrap buying price delivered to refiners cents/lb","US Cents","pound","Daily",0]
["Scrap","1514","MB-CU-0304","No. 2 copper scrap buying price delivered to refiners cents/lb","US Cents","pound","Daily",0]
["Scrap","1515","MB-CU-0305","No. 1 bare bright copper scrap buying price delivered to brass ingot makers cents/lb","US Cents","pound","Daily",0]
["Scrap","1516","MB-CU-0306","No. 1 copper scrap buying price delivered to brass ingot makers cents/lb","US Cents","pound","Daily",0]
["Scrap","1517","MB-CU-0307","No. 2 copper scrap buying price delivered to brass ingot makers cents/lb","US Cents","pound","Daily",0]
["Scrap","1518","MB-CU-0308","Light Copper scrap buying price delivered to brass ingot makers cents/lb","US Cents","pound","Daily",0]
["Scrap","16","MB-AL-0015","Aluminium Scrap, Group 7 turnings, United Kingdom, delivered consumer works, £ per tonne","GBP","tonne","Weekly",0]
["Scrap","17","MB-AL-0016","Aluminium Scrap, LM24 Pressure diecasting ingot, UK, delivered consumer works,","GBP","tonne","weekly",0]
["Scrap","177","MB-TI-0001","Titanium scrap Turnings unprocessed type 90/6/4, 0.5% Sn max,cif major Eur ports $/lb","USD","pound","Weekly",0]
["Scrap","178","MB-TI-0002","Titanium scrap,Turnings unprocessed type 90/6/4,0.5-2% Sn max,cif major Eurports $/lb","USD","pound","Weekly",0]
["Scrap","1789","MB-AL-0278","Aluminium Scrap, Group 1 Pure 99% & Litho, United Kingdom, delivered consumer works, scrap discount £ per tonne","GBP","tonne","Weekly",0]
["Scrap","1790","MB-AL-0279","Aluminium Scrap, Commercial Pure Cuttings, United Kingdom, delivered consumer works, scrap discount £ per tonne","GBP","tonne","Weekly",0]
["Scrap","1791","MB-AL-0280","Aluminium Scrap, Clean HE9 extrusions, United Kingdom, delivered consumer works, scrap discount £ per tonne","GBP","tonne","Weekly",0]
["Scrap","1792","MB-AL-0281","Aluminium Scrap, Loose Old Rolled cuttings, United Kingdom, delivered consumer works, scrap discount £ per tonne","GBP","tonne","Weekly",0]
["Scrap","1793","MB-AL-0282","Aluminium Scrap, Baled Old Rolled, United Kingdom, delivered consumer works, scrap discount £ per tonne","GBP","tonne","Weekly",0]
["Scrap","1794","MB-AL-0283","Aluminium Scrap, Commercial Cast, United Kingdom, delivered consumer works, scrap discount £ per tonne","GBP","tonne","Weekly",0]
["Scrap","1795","MB-AL-0284","Aluminium Scrap, Cast Wheels, United Kingdom, delivered consumer works, scrap discount £ per tonne","GBP","tonne","Weekly",0]
["Scrap","1796","MB-AL-0285","Aluminium Scrap, Commercial turnings, United Kingdom, delivered consumer works, scrap discount £ per tonne","GBP","tonne","Weekly",0]
["Scrap","1797","MB-AL-0286","Aluminium Scrap, Group 7 turnings, United Kingdom, delivered consumer works, scrap discount £ per tonne","GBP","tonne","Weekly",0]
["Scrap","18","MB-AL-0017","Aluminium Scrap, LM6/LM25 Gravity diecasting ingot, UK, delivered consumer works","GBP","tonne","weekly",0]
["Scrap","180","MB-STS-0010","UK domestic 18/8 solids wholesale £ per tonne del merchants","GBP","tonne","Weekly",0]
["Scrap","181","MB-STS-0011","UK domestic 18/8 turnings wholesale £ per tonne del merchants","GBP","tonne","Weekly",0]
["Scrap","182","MB-STE-0077","UK domestic ferrous scrap 1&2 Old Steel £ per tonne del consumer","GBP","tonne","Monthly",0]
["Scrap","183","MB-STE-0078","UK domestic ferrous scrap 11A Cast Iron Borings (low phos)  del consumer GBP/tonne","GBP","tonne","Monthly",0]
["Scrap","1845","MB-STS-0138","Southeast 304 solids clips stainless steel scrap broker buying $/gross ton","USD","gross ton","Weekly",0]
["Scrap","1846","MB-STS-0139","Southeast 304 turnings stainless steel scrap  broker buying $/gross ton","USD","gross ton","Weekly",0]
["Scrap","1847","MB-STS-0140","Southeast 316 solids clips stainless steel scrap  broker buying $/gross ton","USD","gross ton","Weekly",0]
["Scrap","1848","MB-STS-0141","Southeast 409 bundles solids stainless steel scrap  broker buying $/gross ton","USD","gross ton","Weekly",0]
["Scrap","1849","MB-STS-0142","Southeast 409 turnings stainless steel scrap broker buying $/gross ton","USD","gross ton","Weekly",0]
["Scrap","185","MB-STE-0080","UK domestic ferrous scrap 4A New Steel Bales £ per tonne del consumer","GBP","tonne","Monthly",0]
["Scrap","1850","MB-STS-0143","Southeast 430 bundles solids stainless steel scrap broker buying $ gross ton","USD","gross ton","Weekly",0]
["Scrap","1851","MB-STS-0144","Southeast 430 turnings stainless steel scrap  broker buying $/gross ton","USD","gross ton","Weekly",0]
["Scrap","1852","MB-STS-0145","Southeast 304 new clips stainless steel scrap  dealer buying price cents/lb","US Cents","pound","Weekly",0]
["Scrap","1853","MB-STS-0146","Southeast 304 solids clips stainless steel scrap dealer buying price cents/lb","US Cents","pound","Weekly",0]
["Scrap","1854","MB-STS-0147","Southeast 304 turnings stainless steel scrap dealer buying price cents/lb","US Cents","pound","Weekly",0]
["Scrap","1855","MB-STS-0148","Southeast 316 solids clips stainless steel scrap dealer buying price cents/lb","US Cents","pound","Weekly",0]
["Scrap","1856","MB-STS-0149","Southeast 430 new clips stainless steel scrap dealer buying price cents/lb","US Cents","pound","Weekly",0]
["Scrap","186","MB-STE-0081","UK domestic ferrous scrap 4C New Steel Bales £ per tonne del consumer","GBP","tonne","Monthly",0]
["Scrap","1864","MB-STS-0150","Southeast 304 solids, clips, broker buying, US cents per pound","US Cents","pound","Weekly",0]
["Scrap","1865","MB-STS-0151","Southeast 304 turnings, broker buying, US cents per pound","US Cents","pound","Weekly",0]
["Scrap","1866","MB-STS-0152","Southeast 316 solids, clips, broker buying, US cents per pound","US Cents","pound","Weekly",0]
["Scrap","1867","MB-STS-0153","Southeast 409 bundles, solids, broker buying, US cents per pound","US Cents","pound","Weekly",0]
["Scrap","1868","MB-STS-0154","Southeast 409 turnings, broker buying, US cents per pound","US Cents","pound","Weekly",0]
["Scrap","1869","MB-STS-0155","Southeast 430 bundles, solids, broker buying, US cents per pound","US Cents","pound","Weekly",0]
["Scrap","187","MB-STS-0012","UK domestic ferrous scrap 5C Loose Old Light £ per tonne del consumers","GBP","tonne","Weekly",0]
["Scrap","1870","MB-STS-0156","Southeast 430 turnings, broker buying, US cents per pound","US Cents","pound","Weekly",0]
["Scrap","1871","MB-STS-0157","Southeast 304 new clips, dealer buying price, $ per gross ton","USD","gross ton","Weekly",0]
["Scrap","1872","MB-STS-0158","Southeast 304 solids, clips, dealer buying price, $ per gross ton","USD","gross ton","Weekly",0]
["Scrap","1873","MB-STS-0159","Southeast 304 turnings, dealer buying price, $ per gross ton","USD","gross ton","Weekly",0]
["Scrap","1874","MB-STS-0160","Southeast 316 solids, clips, dealer buying price, $ per gross ton","USD","gross ton","Weekly",0]
["Scrap","1875","MB-STS-0161","Southeast 430 new clips, dealer buying price, $ per gross ton","USD","gross ton","Weekly",0]
["Scrap","1876","MB-STS-0162","Pittsburgh 316 solids, clips, dealer buying, $ per gross ton","USD","gross ton","Weekly",0]
["Scrap","1877","MB-STS-0163","Pittsburgh 304 solids, clips, dealer buying, $ per gross ton","USD","gross ton","Weekly",0]
["Scrap","1878","MB-STS-0164","Pittsburgh 304 turnings, dealer buying, $ per gross ton","USD","gross ton","Weekly",0]
["Scrap","1879","MB-STS-0165","Pittsburgh 304 new clips, dealer buying, $ per gross ton","USD","gross ton","Weekly",0]
["Scrap","1880","MB-STS-0166","Pittsburgh 430 new clips, dealer buying, $ per gross ton","USD","gross ton","Weekly",0]
["Scrap","1881","MB-STS-0167","Pittsburgh 316 solids, clips, broker buying, US cents per pound","US Cents","pound","Weekly",0]
["Scrap","1882","MB-STS-0168","Pittsburgh 304 solids, clips, broker buying, US cents per pound","US Cents","pound","Weekly",0]
["Scrap","1883","MB-STS-0169","Pittsburgh 304 turnings, broker buying, US cents per pound","US Cents","pound","Weekly",0]
["Scrap","1884","MB-STS-0170","Pittsburgh 430 bundles, solids, broker buying, US cents per pound","US Cents","pound","Weekly",0]
["Scrap","1885","MB-STS-0171","Pittsburgh 430 turnings, broker buying, US cents per pound","US Cents","pound","Weekly",0]
["Scrap","1886","MB-STS-0172","Pittsburgh 409 bundles, solids, broker buying, US cents per pound","US Cents","pound","Weekly",0]
["Scrap","1887","MB-STS-0173","Pittsburgh 409 turnings, broker buying, US cents per pound","US Cents","pound","Weekly",0]
["Scrap","1888","MB-STS-0174","Boston 316 solids, clips, dealer buying, $ per gross ton","USD","gross ton","Weekly",0]
["Scrap","1889","MB-STS-0175","Boston 304 solids, clips, dealer buying, $ per gross ton","USD","gross ton","Weekly",0]
["Scrap","189","MB-STE-0083","UK domestic ferrous scrap 8A New Loose Light Cuttings £ per tonne del consumer","GBP","tonne","Monthly",0]
["Scrap","1890","MB-STS-0176","Boston 304 turnings, dealer buying, $ per gross ton","USD","gross ton","Weekly",0]
["Scrap","1891","MB-STS-0177","Boston 430 new clips, dealer buying, $ per gross ton","USD","gross ton","Weekly",0]
["Scrap","1892","MB-STS-0178","Boston 430 bundles, solids, export yard, US cents per pound","US Cents","pound","Weekly",0]
["Scrap","1897","MB-STS-0183","Chicago 316 solids, clips, dealer buying, $ per gross ton","USD","gross ton","Weekly",0]
["Scrap","1898","MB-STS-0184","Chicago 304 solids, clips, dealer buying, $ per gross ton","USD","gross ton","Weekly",0]
["Scrap","1899","MB-STS-0185","Chicago 304 turnings, dealer buying, $ per gross ton","USD","gross ton","Weekly",0]
["Scrap","19","MB-AL-0018","Aluminium Scrap, Loose Old Rolled cuttings, United Kingdom, delivered consumer works, £ per tonne","GBP","tonne","Weekly",0]
["Scrap","190","MB-STE-0084","UK domestic ferrous scrap 8B New Loose Light Cuttings £ per tonne del consumer","GBP","tonne","Monthly",0]
["Scrap","1900","MB-STS-0186","Chicago 304 new clips, dealer buying, $ per gross ton","USD","gross ton","Weekly",0]
["Scrap","1901","MB-STS-0187","Chicago 430 new clips, dealer buying, $ per gross ton","USD","gross ton","Weekly",0]
["Scrap","1902","MB-STS-0188","Chicago 316 solids, clips, broker buying, US cents per pound","US Cents","pound","Weekly",0]
["Scrap","1903","MB-STS-0189","Chicago 304 solids, clips, broker buying, US cents per pound","US Cents","pound","Weekly",0]
["Scrap","1904","MB-STS-0190","Chicago 304 turnings, broker buying, US cents per pound","US Cents","pound","Weekly",0]
["Scrap","1905","MB-STS-0191","Chicago 430 bundles, solids, broker buying, US cents per pound","US Cents","pound","Weekly",0]
["Scrap","1906","MB-STS-0192","Chicago 430 turnings, broker buying, US cents per pound","US Cents","pound","Weekly",0]
["Scrap","1907","MB-STS-0193","Chicago 409 bundles, solids, broker buying, US cents per pound","US Cents","pound","Weekly",0]
["Scrap","1908","MB-STS-0194","Chicago 409 turnings, broker buying, US cents per pound","US Cents","pound","Weekly",0]
["Scrap","1909","MB-STS-0195","Cleveland 316 solids, clips, dealer buying, $ per gross ton","USD","gross ton","Weekly",0]
["Scrap","191","MB-STE-0085","UK domestic ferrous scrap 9A/10 Heavy and Light Cast Iron  del consumer GBP/tonne","GBP","tonne","Monthly",0]
["Scrap","1910","MB-STS-0196","Cleveland 304 solids, clips, dealer buying, $ per gross ton","USD","gross ton","Weekly",0]
["Scrap","1911","MB-STS-0197","Cleveland 304 turnings, dealer buying, $ per gross ton","USD","gross ton","Weekly",0]
["Scrap","1912","MB-STS-0198","Cleveland 304 new clips, dealer buying, $ per gross ton","USD","gross ton","Weekly",0]
["Scrap","1913","MB-STS-0199","Cleveland 430 new clips, dealer buying, $ per gross ton","USD","gross ton","Weekly",0]
["Scrap","1914","MB-STS-0200","Cleveland 316 solids, clips, broker buying, US cents per pound","US Cents","pound","Weekly",0]
["Scrap","1915","MB-STS-0201","Cleveland 304 solids, clips, broker buying, US cents per pound","US Cents","pound","Weekly",0]
["Scrap","1916","MB-STS-0202","Cleveland 304 turnings, broker buying, US cents per pound","US Cents","pound","Weekly",0]
["Scrap","1917","MB-STS-0203","Detroit 316 solids, clips, dealer buying, $ per gross ton","USD","gross ton","Weekly",0]
["Scrap","1918","MB-STS-0204","Detroit 304 solids, clips, dealer buying, $ per gross ton","USD","gross ton","Weekly",0]
["Scrap","1919","MB-STS-0205","Detroit 304 turnings, dealer buying, $ per gross ton","USD","gross ton","Weekly",0]
["Scrap","192","MB-STE-0086","UK domestic ferrous scrap 9B/C Cylinder Block Scrap £ per tonne del consumer","GBP","tonne","Monthly",0]
["Scrap","1920","MB-STS-0206","Detroit 304 new clips, dealer buying, $ per gross ton","USD","gross ton","Weekly",0]
["Scrap","1921","MB-STS-0207","Detroit 430 new clips, dealer buying, $ per gross ton","USD","gross ton","Weekly",0]
["Scrap","1922","MB-STS-0208","Detroit 316 solids, clips, broker buying, US cents per pound","US Cents","pound","Weekly",0]
["Scrap","1923","MB-STS-0209","Detroit 304 solids, clips, broker buying, US cents per pound","US Cents","pound","Weekly",0]
["Scrap","1924","MB-STS-0210","Detroit 304 turnings, broker buying, US cents per pound","US Cents","pound","Weekly",0]
["Scrap","1925","MB-STS-0211","Detroit 430 bundles, solids, broker buying, US cents per pound","US Cents","pound","Weekly",0]
["Scrap","1926","MB-STS-0212","Detroit 409 bundles, solids, broker buying, US cents per pound","US Cents","pound","Weekly",0]
["Scrap","1927","MB-STS-0213","Detroit 409 turnings, broker buying, US cents per pound","US Cents","pound","Weekly",0]
["Scrap","1928","MB-STS-0214","Houston 316 solids, clips, dealer buying, $ per gross ton","USD","gross ton","Weekly",0]
["Scrap","1929","MB-STS-0215","Houston 304 solids, clips, dealer buying, $ per gross ton","USD","gross ton","Weekly",0]
["Scrap","193","MB-STE-0087","UK domestic ferrous scrap OA Plate and Structural £ per tonne del consumer","GBP","tonne","Monthly",0]
["Scrap","1930","MB-STS-0216","Houston 304 turnings, dealer buying, $ per gross ton","USD","gross ton","Weekly",0]
["Scrap","1931","MB-STS-0217","Houston 316 solids, clips, broker buying, US cents per pound","US Cents","pound","Weekly",0]
["Scrap","1932","MB-STS-0218","Houston 304 solids, clips, broker buying, US cents per pound","US Cents","pound","Weekly",0]
["Scrap","1933","MB-STS-0219","Houston 304 turnings, broker buying, US cents per pound","US Cents","pound","Weekly",0]
["Scrap","1934","MB-STS-0220","Houston 430 bundles, solids, broker buying, US cents per pound","US Cents","pound","Weekly",0]
["Scrap","1935","MB-STS-0221","Houston 409 bundles, solids, broker buying, US cents per pound","US Cents","pound","Weekly",0]
["Scrap","1936","MB-STS-0222","Los Angeles 316 solids, clips, dealer buying, $ per gross ton","USD","gross ton","Weekly",0]
["Scrap","1937","MB-STS-0223","Los Angeles 304 solids, clips, dealer buying, $ per gross ton","USD","gross ton","Weekly",0]
["Scrap","1938","MB-STS-0224","Los Angeles 304 turnings, dealer buying, $ per gross ton","USD","gross ton","Weekly",0]
["Scrap","1939","MB-STS-0225","Los Angeles 304 new clips, dealer buying, $ per gross ton","USD","gross ton","Weekly",0]
["Scrap","194","MB-STS-0013","UK domestic stainless steel scrap 12-13% Cr Solids £ per tonne del merchants","GBP","tonne","Weekly",0]
["Scrap","1940","MB-STS-0226","Los Angeles 304 solids, clips, export yard, US cents per pound","US Cents","pound","Weekly",0]
["Scrap","1941","MB-STS-0227","Los Angeles 304 turnings, export yard, US cents per pound","US Cents","pound","Weekly",0]
["Scrap","1942","MB-STS-0228","Los Angeles 430 bundles, solids, export yard, US cents per pound","US Cents","pound","Weekly",0]
["Scrap","1943","MB-STS-0229","New York 316 solids, clips, dealer buying, $ per gross ton","USD","gross ton","Weekly",0]
["Scrap","1944","MB-STS-0230","New York 304 solids, clips, dealer buying, $ per gross ton","USD","gross ton","Weekly",0]
["Scrap","1945","MB-STS-0231","New York 304 turnings, dealer buying, $ per gross ton","USD","gross ton","Weekly",0]
["Scrap","1946","MB-STS-0232","New York 304 new clips, dealer buying, $ per gross ton","USD","gross ton","Weekly",0]
["Scrap","1947","MB-STS-0233","New York 430 new clips, dealer buying, $ per gross ton","USD","gross ton","Weekly",0]
["Scrap","1948","MB-STS-0234","New York 316 solids, clips, broker buying, US cents per pound","US Cents","pound","Weekly",0]
["Scrap","1949","MB-STS-0235","New York 304 solids, clips, broker buying, US cents per pound","US Cents","pound","Weekly",0]
["Scrap","195","MB-STS-0014","UK domestic stainless steel scrap 16-17% Cr solids £ per tonne del merchants","GBP","tonne","Weekly",0]
["Scrap","1950","MB-STS-0236","New York 304 turnings, broker buying, US cents per pound","US Cents","pound","Weekly",0]
["Scrap","1951","MB-STS-0237","New York 304 solids, clips, export yard, US cents per pound","US Cents","pound","Weekly",0]
["Scrap","1952","MB-STS-0238","New York 304 turnings, export yard, US cents per pound","US Cents","pound","Weekly",0]
["Scrap","1953","MB-STS-0239","New York 430 bundles, solids, export yard, US cents per pound","US Cents","pound","Weekly",0]
["Scrap","1954","MB-STS-0240","Philadelphia 304 solids, clips, export yard, US cents per pound","US Cents","pound","Weekly",0]
["Scrap","1955","MB-STS-0241","Philadelphia 304 turnings, export yard, US cents per pound","US Cents","pound","Weekly",0]
["Scrap","1956","MB-STS-0242","Philadelphia 430 bundles, solids, export yard, US cents per pound","US Cents","pound","Weekly",0]
["Scrap","1957","MB-STS-0243","San Francisco 316 solids, clips, dealer buying, $ per gross ton","USD","gross ton","Weekly",0]
["Scrap","1958","MB-STS-0244","San Francisco 304 solids, clips, dealer buying, $ per gross ton","USD","gross ton","Weekly",0]
["Scrap","1959","MB-STS-0245","San Francisco 304 turnings, dealer buying, $ per gross ton","USD","gross ton","Weekly",0]
["Scrap","1960","MB-STS-0246","San Francisco 304 new clips, dealer buying, $ per gross ton","USD","gross ton","Weekly",0]
["Scrap","1961","MB-STS-0247","San Francisco 304 solids, clips, export yard, US cents per pound","US Cents","pound","Weekly",0]
["Scrap","1962","MB-STS-0248","San Francisco 304 turnings, export yard, US cents per pound","US Cents","pound","Weekly",0]
["Scrap","1963","MB-STS-0249","San Francisco 430 bundles, solids, export yard, US cents per pound","US Cents","pound","Weekly",0]
["Scrap","1964","MB-STS-0250","Montreal 316 solids, clips, dealer buying, Canadian $ per gross ton","CAD","gross ton","Weekly",0]
["Scrap","1965","MB-STS-0251","Montreal 304 solids, clips, dealer buying, Canadian $ per gross ton","CAD","gross ton","Weekly",0]
["Scrap","1966","MB-STS-0252","Montreal 304 turnings, dealer buying, Canadian $ per gross ton","CAD","gross ton","Weekly",0]
["Scrap","1967","MB-STS-0253","Montreal 304 new clips, dealer buying, Canadian $ per gross ton","CAD","gross ton","Weekly",0]
["Scrap","1968","MB-STS-0254","Pittsburgh 316 solids, clips, consumer buying, US cents per pound","US Cents","pound","Weekly",0]
["Scrap","1969","MB-STS-0255","Pittsburgh 304 solids, clips, consumer buying, US cents per pound","US Cents","pound","Weekly",0]
["Scrap","1970","MB-STS-0256","Pittsburgh 304 turnings, consumer buying, US cents per pound","US Cents","pound","Weekly",0]
["Scrap","1971","MB-STS-0257","Pittsburgh 430 bundles, solids, consumer buying, US cents per pound","US Cents","pound","Weekly",0]
["Scrap","1972","MB-STS-0258","Pittsburgh 409 bundles, solids, consumer buying, US cents per pound","US Cents","pound","Weekly",0]
["Scrap","1974","MB-CU-0360","No.2 Copper (Birch/Cliff) imported into China 94-96% cif China cents per Ib at a discount to LME or Comex","US Cents","pound","Monthly",0]
["Scrap","1989","MB-STE-0519","Alabama shredded auto scrap consumer buying price US$/gross ton weekly composite","USD","gross ton","Monthly",0]
["Scrap","1990","MB-STE-0520","Chicago shredded auto scrap consumer buying price US$/gross ton weekly composite","USD","gross ton","Monthly",0]
["Scrap","1991","MB-STE-0521","Philadelphia shredded auto scrap consumer buying price US$/gross ton weekly composite","USD","gross ton","Monthly",0]
["Scrap","1992","MB-STE-0522","Pittsburgh shredded auto scrap consumer buying price US$/gross ton weekly composite","USD","gross ton","Monthly",0]
["Scrap","1993","MB-STE-0523","Shredded auto scrap consumer buying price US$/gross ton weekly composite","USD","gross ton","Monthly",0]
["Scrap","1994","MB-STE-0524","Chicago no. 1  busheling scrap consumer buying price US$/gross ton weekly composite price","USD","gross ton","Monthly",0]
["Scrap","1995","MB-STE-0525","Cleveland no. 1  busheling scrap consumer buying price US$/gross ton weekly composite","USD","gross ton","Monthly",0]
["Scrap","1996","MB-STE-0526","Pittsburgh no. 1 busheling consumer buying price US$/gross ton weekly composite","USD","gross ton","Monthly",0]
["Scrap","1997","MB-STE-0527","No. 1  busheling scrap consumer buying price US$/gross ton weekly composite","USD","gross ton","Monthly",0]
["Scrap","1998","MB-STE-0528","Chicago no. 1 heavy melt consumer buying price US$/gross ton weekly composite","USD","gross ton","Monthly",0]
["Scrap","1999","MB-STE-0529","Philadelphia no. 1 heavy melt consumer buying price US$/gross ton weekly composite","USD","gross ton","Monthly",0]
["Scrap","20","MB-AL-0019","Aluminium Scrap, Mixed Turnings, Europe, del consumer works, € per tonne","EUR","tonne","Weekly",0]
["Scrap","2000","MB-STE-0530","Pittsburgh no. 1 heavy melt consumer buying price US$/gross ton weekly composite","USD","gross ton","Monthly",0]
["Scrap","2002","MB-STE-0531","No. 1 heavy melt consumer buying price US$/gross ton weekly composite","USD","gross ton","Monthly",0]
["Scrap","203","MB-STE-0093","Turkey domestic auto bundle scrap Turkish lira per tonne delivered","TRY","tonne","Weekly",0]
["Scrap","2033","MB-STE-0533","Monterrey No. 1 heavy melt scrap consumer buying price $/tonne","USD","tonne","Monthly",0]
["Scrap","2034","MB-STE-0534","Monterrey No. 1 heavy melt scrap consumer buying price Peso/tonne","MXN","tonne","Monthly",0]
["Scrap","2035","MB-STE-0535","Monterrey Shredded auto scrap consumer buying price $/tonne","USD","tonne","Monthly",0]
["Scrap","2036","MB-STE-0536","Monterrey Shredded auto scrap consumer buying price Peso/tonne","MXN","tonne","Monthly",0]
["Scrap","2037","MB-STE-0537","Monterrey Cut structural/plate 3ft. max. scrap consumer buying price $/tonne","USD","tonne","Monthly",0]
["Scrap","2038","MB-STE-0538","Monterrey Cut structural/plate 3ft. max. scrap consumer buying price Peso/tonne","MXN","tonne","Monthly",0]
["Scrap","2039","MB-STE-0539","Monterrey No. 1 busheling scrap consumer buying price $/tonne","USD","tonne","Monthly",0]
["Scrap","204","MB-STE-0094","Turkey domestic melting scrap from shipbreaking $ per tonne delivered","USD","tonne","Weekly",0]
["Scrap","2040","MB-STE-0540","Monterrey No. 1 busheling scrap consumer buying price Peso/tonne","MXN","tonne","Monthly",0]
["Scrap","2041","MB-STE-0541","Monterrey Machine shop turnings scrap consumer buying price $/tonne","USD","tonne","Monthly",0]
["Scrap","2042","MB-STE-0542","Monterrey Machine shop turnings scrap consumer buying price Peso/tonne","MXN","tonne","Monthly",0]
["Scrap","205","MB-STE-0095","Turkey import ferrous scrap shredded $ per tonne cfr main Turkish port","USD","tonne","Weekly",0]
["Scrap","206","MB-STE-0096","Turkey import ferrous scrap HMS 1&2 (75:25 mix) $ per tonne cfr main port","USD","tonne","Weekly",0]
["Scrap","207","MB-STE-0097","Ferrous scrap Rotterdam export HMS 1&2 (70:30 mix) $ per tonne fob Rotterdam","USD","tonne","Weekly",0]
["Scrap","208","MB-STE-0098","Ferrous scrap Rotterdam export shredded $ per tonne fob Rotterdam","USD","tonne","Weekly",0]
["Scrap","209","MB-STE-0099","UK export ferrous scrap shredded $ per tonne fob main port","USD","tonne","Weekly",0]
["Scrap","210","MB-STE-0100","UK export ferrous scrap HMS 1&2 (80:20 mix) fob main port $/tonne","USD","tonne","Weekly",0]
["Scrap","2394","MB-AU-0015","Buffalo Plate and structurals, 2 ft. and under broker buying price $/per gross ton","USD","gross ton","Weekly",0]
["Scrap","2395","MB-AU-0016","Buffalo Plate and structurals, 5 ft. and under broker buying price $/per gross ton","USD","gross ton","Weekly",0]
["Scrap","2396","MB-AU-0017","Buffalo Rails, 2 ft. and under broker buying price $/per gross ton","USD","gross ton","Weekly",0]
["Scrap","2397","MB-AU-0018","Buffalo Rails, random length broker buying price $/per gross ton","USD","gross ton","Weekly",0]
["Scrap","2398","MB-AU-0019","Buffalo Red brass solids scrap dealer buying price delivered to yard cents/lb","US Cents","pound","twice monthly",0]
["Scrap","2399","MB-AU-0020","Buffalo Red brass turnings, borings scrap dealer buying price delivered to yard cents/lb","US Cents","pound","twice monthly",0]
["Scrap","2400","MB-AU-0021","Buffalo Segregated low-copper clips scrap dealer buying price delivered to yard cents/lb","US Cents","pound","twice monthly",0]
["Scrap","2401","MB-AU-0022","Buffalo Shoveling turnings broker buying price $/per gross ton","USD","gross ton","Weekly",0]
["Scrap","2402","MB-AU-0023","Buffalo Shredded auto scrap dealer selling price $/gross ton","USD","gross ton","Monthly",0]
["Scrap","2502","MB-STE-0547","Bajio Cut structural/plate 3ft max. scrap consumer buying price $/tonne","USD","tonne","Monthly",0]
["Scrap","2503","MB-STE-0548","Bajio Cut structural/plate 3ft max. scrap consumer buying price Peso/tonne","MXN","tonne","Monthly",0]
["Scrap","2504","MB-STE-0549","Bajio Machine shop turnings scrap consumer buying price $/tonne","USD","tonne","Monthly",0]
["Scrap","2505","MB-STE-0550","Bajio Machine shop turnings scrap consumer buying price Peso/tonne","MXN","tonne","Monthly",0]
["Scrap","2506","MB-STE-0551","Bajio No. 1 busheling scrap consumer buying price $/tonne","USD","tonne","Monthly",0]
["Scrap","2507","MB-STE-0552","Bajio No. 1 busheling scrap consumer buying price Peso/tonne","MXN","tonne","Monthly",0]
["Scrap","2508","MB-STE-0553","Bajio No. 1 heavy melt scrap consumer buying price $/tonne","USD","tonne","Monthly",0]
["Scrap","2509","MB-STE-0554","Bajio No. 1 heavy melt scrap consumer buying price Peso/tonne","MXN","tonne","Monthly",0]
["Scrap","2510","MB-STE-0555","Bajio Shredded auto scrap consumer buying price $/tonne","USD","tonne","Monthly",0]
["Scrap","2511","MB-STE-0556","Bajio Shredded auto scrap consumer buying price Peso/tonne","MXN","tonne","Monthly",0]
["Scrap","2686","MB-STE-0567","Chicago No. 1 heavy melting consumer buying $/per gross ton","USD","gross ton","Weekly",0]
["Scrap","2687","MB-STE-0568","Chicago No. 1 dealer bundles consumer buying $/per gross ton","USD","gross ton","Weekly",0]
["Scrap","2688","MB-STE-0569","Chicago No. 2 bundles consumer buying $/per gross ton","USD","gross ton","Weekly",0]
["Scrap","2689","MB-STE-0570","Chicago No. 1 busheling consumer buying $/per gross ton","USD","gross ton","Weekly",0]
["Scrap","2690","MB-STE-0571","Chicago Shredded scrap consumer buying $/per gross ton","USD","gross ton","Weekly",0]
["Scrap","2691","MB-STE-0572","Chicago Machine shop turnings consumer buying $/per gross ton","USD","gross ton","Weekly",0]
["Scrap","2692","MB-STE-0573","Chicago Cast iron borings consumer buying $/per gross ton","USD","gross ton","Weekly",0]
["Scrap","2693","MB-STE-0574","Chicago Cast iron borings, foundry consumer buying $/per gross ton","USD","gross ton","Weekly",0]
["Scrap","2694","MB-STE-0575","Chicago Plate and structurals, 5 ft. and under consumer buying $/per gross ton","USD","gross ton","Weekly",0]
["Scrap","2695","MB-STE-0576","Chicago Plate and structurals, 2 ft. and under consumer buying $/per gross ton","USD","gross ton","Weekly",0]
["Scrap","2696","MB-STE-0577","Chicago Low-residual, black foundry busheling consumer buying $/per gross ton","USD","gross ton","Weekly",0]
["Scrap","2697","MB-STE-0578","Chicago Low-residual, ductile-quality shredded clips consumer buying $/per gross ton","USD","gross ton","Weekly",0]
["Scrap","2698","MB-STE-0579","Chicago Low-alloy punchings consumer buying $/per gross ton","USD","gross ton","Weekly",0]
["Scrap","2699","MB-STE-0580","Chicago Rails, random length dealer buying $/per gross ton","USD","gross ton","Weekly",0]
["Scrap","2700","MB-STE-0581","Chicago Reroller rails consumer buying $/per gross ton","USD","gross ton","Weekly",0]
["Scrap","2701","MB-STE-0582","Chicago Rails, 2 ft. and under consumer buying $/per gross ton","USD","gross ton","Weekly",0]
["Scrap","2702","MB-STE-0583","Chicago No. 1 machinery cast consumer buying $/per gross ton","USD","gross ton","Weekly",0]
["Scrap","2703","MB-STE-0584","Chicago Clean auto cast consumer buying $/per gross ton","USD","gross ton","Weekly",0]
["Scrap","2704","MB-STE-0585","Chicago Cupola cast consumer buying $/per gross ton","USD","gross ton","Weekly",0]
["Scrap","2705","MB-STE-0586","Chicago Stove plate consumer buying $/per gross ton","USD","gross ton","Weekly",0]
["Scrap","2706","MB-STE-0587","Chicago Steel car wheels consumer buying $/per gross ton","USD","gross ton","Weekly",0]
["Scrap","2707","MB-STS-0263","Chicago 18-8 bundles and solids broker buying $/per gross ton","USD","gross ton","Weekly",0]
["Scrap","2708","MB-STS-0264","Chicago 18-8 turnings broker buying $/per gross ton","USD","gross ton","Weekly",0]
["Scrap","2709","MB-STS-0265","Chicago 430 bundles and solids broker buying $/per gross ton","USD","gross ton","Weekly",0]
["Scrap","2710","MB-STE-0588","Pittsburgh No. 1 heavy melting consumer buying $/per gross ton","USD","gross ton","Weekly",0]
["Scrap","2711","MB-STE-0589","Pittsburgh No. 2 heavy melting consumer buying $/per gross ton","USD","gross ton","Weekly",0]
["Scrap","2712","MB-STE-0590","Pittsburgh No. 1 dealer bundles consumer buying $/per gross ton","USD","gross ton","Weekly",0]
["Scrap","2713","MB-STE-0591","Pittsburgh No. 2 bundles consumer buying $/per gross ton","USD","gross ton","Weekly",0]
["Scrap","2714","MB-STE-0592","Pittsburgh No. 1 busheling consumer buying $/per gross ton","USD","gross ton","Weekly",0]
["Scrap","2715","MB-STE-0593","Pittsburgh Shredded scrap consumer buying $/per gross ton","USD","gross ton","Weekly",0]
["Scrap","2716","MB-STE-0594","Pittsburgh Machine shop turnings consumer buying $/per gross ton","USD","gross ton","Weekly",0]
["Scrap","2717","MB-STE-0595","Pittsburgh Shoveling turnings consumer buying $/per gross ton","USD","gross ton","Weekly",0]
["Scrap","2718","MB-STE-0596","Pittsburgh Cast iron borings consumer buying $/per gross ton","USD","gross ton","Weekly",0]
["Scrap","2719","MB-STE-0597","Pittsburgh Plate and structurals, 5 ft. and under consumer buying $/per gross ton","USD","gross ton","Weekly",0]
["Scrap","2720","MB-STE-0598","Pittsburgh Punchings and plate consumer buying $/per gross ton","USD","gross ton","Weekly",0]
["Scrap","2721","MB-STE-0599","Pittsburgh Foundry steel, 2 ft. and under consumer buying $/per gross ton","USD","gross ton","Weekly",0]
["Scrap","2722","MB-STE-0600","Pittsburgh Heavy turnings consumer buying $/per gross ton","USD","gross ton","Weekly",0]
["Scrap","2723","MB-STE-0601","Pittsburgh No. 1 RR hvy. melting consumer buying $/per gross ton","USD","gross ton","Weekly",0]
["Scrap","2724","MB-STE-0602","Pittsburgh Rails, 2 ft. and under consumer buying $/per gross ton","USD","gross ton","Weekly",0]
["Scrap","2725","MB-STE-0603","Pittsburgh Rails, random length consumer buying $/per gross ton","USD","gross ton","Weekly",0]
["Scrap","2726","MB-STE-0604","Pittsburgh RR specialties consumer buying $/per gross ton","USD","gross ton","Weekly",0]
["Scrap","2727","MB-STE-0605","Pittsburgh No. 1 machinery cast consumer buying $/per gross ton","USD","gross ton","Weekly",0]
["Scrap","2728","MB-STE-0606","Pittsburgh Cupola cast consumer buying $/per gross ton","USD","gross ton","Weekly",0]
["Scrap","2729","MB-STE-0607","Pittsburgh Heavy breakable cast consumer buying $/per gross ton","USD","gross ton","Weekly",0]
["Scrap","2730","MB-STS-0266","Pittsburgh 18-8 bundles and solids consumer buying $/per gross ton","USD","gross ton","Weekly",0]
["Scrap","2731","MB-STS-0267","Pittsburgh 18-8 turnings consumer buying $/per gross ton","USD","gross ton","Weekly",0]
["Scrap","2732","MB-STS-0268","Pittsburgh 18-8 bundles and solids broker buying $/per gross ton","USD","gross ton","Weekly",0]
["Scrap","2733","MB-STS-0269","Pittsburgh 18-8 turnings broker buying $/per gross ton","USD","gross ton","Weekly",0]
["Scrap","2734","MB-STE-0608","Philadelphia No. 1 heavy melting consumer buying price $/per gross ton","USD","gross ton","Weekly",0]
["Scrap","2735","MB-STE-0609","Philadelphia No. 1 dealer bundles consumer buying price $/per gross ton","USD","gross ton","Weekly",0]
["Scrap","2736","MB-STE-0610","Philadelphia No. 1 busheling consumer buying price $/per gross ton","USD","gross ton","Weekly",0]
["Scrap","2737","MB-STE-0611","Philadelphia No. 1 foundry busheling consumer buying price $/per gross ton","USD","gross ton","Weekly",0]
["Scrap","2738","MB-STE-0612","Philadelphia Shredded scrap consumer buying price $/per gross ton","USD","gross ton","Weekly",0]
["Scrap","2739","MB-STE-0613","Philadelphia Machine shop turnings consumer buying price $/per gross ton","USD","gross ton","Weekly",0]
["Scrap","2740","MB-STE-0614","Philadelphia Plate and structurals, 5 ft. and under consumer buying price $/per gross ton","USD","gross ton","Weekly",0]
["Scrap","2741","MB-STE-0615","Philadelphia Plate and structurals, 2 ft. and under consumer buying price $/per gross ton","USD","gross ton","Weekly",0]
["Scrap","2742","MB-STE-0616","Philadelphia Rails, 2 ft. and under consumer buying price $/per gross ton","USD","gross ton","Weekly",0]
["Scrap","2743","MB-STE-0617","Philadelphia Other track material consumer buying price $/per gross ton","USD","gross ton","Weekly",0]
["Scrap","2744","MB-STE-0618","Philadelphia Cupola cast consumer buying price $/per gross ton","USD","gross ton","Weekly",0]
["Scrap","2745","MB-STE-0619","Philadelphia No. 1 machinery cast consumer buying price $/per gross ton","USD","gross ton","Weekly",0]
["Scrap","2746","MB-STE-0620","Philadelphia Heavy breakable cast consumer buying price $/per gross ton","USD","gross ton","Weekly",0]
["Scrap","2747","MB-STE-0621","St. Louis No. 1 heavy melting broker buying price $/per gross ton","USD","gross ton","Weekly",0]
["Scrap","2748","MB-STE-0622","St. Louis No. 2 heavy melting broker buying price $/per gross ton","USD","gross ton","Weekly",0]
["Scrap","2749","MB-STE-0623","St. Louis No. 1 busheling broker buying price $/per gross ton","USD","gross ton","Weekly",0]
["Scrap","275","MB-STE-0149","China domestic heavy scrap yuan per tonne del mill","RMB","tonne","Weekly",0]
["Scrap","2750","MB-STE-0624","St. Louis No. 1 dealer bundles broker buying price $/per gross ton","USD","gross ton","Weekly",0]
["Scrap","2751","MB-STE-0625","St. Louis No. 2 bundles broker buying price $/per gross ton","USD","gross ton","Weekly",0]
["Scrap","2752","MB-STE-0626","St. Louis Shredded scrap broker buying price $/per gross ton","USD","gross ton","Weekly",0]
["Scrap","2753","MB-STE-0627","St. Louis Machine shop turnings broker buying price $/per gross ton","USD","gross ton","Weekly",0]
["Scrap","2754","MB-STE-0628","St. Louis Shoveling turnings broker buying price $/per gross ton","USD","gross ton","Weekly",0]
["Scrap","2755","MB-STE-0629","St. Louis Cast iron borings broker buying price $/per gross ton","USD","gross ton","Weekly",0]
["Scrap","2756","MB-STE-0630","St. Louis No. 1 RR heavy melting broker buying price $/per gross ton","USD","gross ton","Weekly",0]
["Scrap","2757","MB-STE-0631","St. Louis Plate and structurals, 5 ft. and under broker buying price $/per gross ton","USD","gross ton","Weekly",0]
["Scrap","2758","MB-STE-0632","St. Louis Unstripped motor blocks broker buying price $/per gross ton","USD","gross ton","Weekly",0]
["Scrap","2759","MB-STE-0633","Detroit No. 1 heavy melting broker buying price $/per gross ton","USD","gross ton","Weekly",0]
["Scrap","2760","MB-STE-0634","Detroit No. 1 dealer bundles broker buying price $/per gross ton","USD","gross ton","Weekly",0]
["Scrap","2761","MB-STE-0635","Detroit No. 1 busheling broker buying price $/per gross ton","USD","gross ton","Weekly",0]
["Scrap","2762","MB-STE-0636","Detroit Shredded scrap broker buying price $/per gross ton","USD","gross ton","Weekly",0]
["Scrap","2763","MB-STE-0637","Detroit Plate and structurals, 5ft. and under broker buying price $/per gross ton","USD","gross ton","Weekly",0]
["Scrap","2764","MB-STE-0638","Detroit Machine shop turnings broker buying price $/per gross ton","USD","gross ton","Weekly",0]
["Scrap","2765","MB-STE-0639","Detroit Shoveling turnings broker buying price $/per gross ton","USD","gross ton","Weekly",0]
["Scrap","2766","MB-STE-0640","Detroit Cast iron borings broker buying price $/per gross ton","USD","gross ton","Weekly",0]
["Scrap","2767","MB-STE-0641","Detroit Cupola cast broker buying price $/per gross ton","USD","gross ton","Weekly",0]
["Scrap","2768","MB-STE-0642","Detroit Automobile cast broker buying price $/per gross ton","USD","gross ton","Weekly",0]
["Scrap","2769","MB-STS-0270","Detroit 18-8 bundles and solids broker buying price $/per gross ton","USD","gross ton","Weekly",0]
["Scrap","2770","MB-STS-0271","Detroit 18-8 turnings broker buying price $/per gross ton","USD","gross ton","Weekly",0]
["Scrap","2771","MB-STS-0272","Detroit 430 bundles and solids broker buying price $/per gross ton","USD","gross ton","Weekly",0]
["Scrap","2772","MB-STE-0643","Cleveland No. 1 heavy melting broker buying price $/per gross ton","USD","gross ton","Weekly",0]
["Scrap","2773","MB-STE-0644","Cleveland No. 2 heavy melting broker buying price $/per gross ton","USD","gross ton","Weekly",0]
["Scrap","2774","MB-STE-0645","Cleveland No. 1 dealer bundles broker buying price $/per gross ton","USD","gross ton","Weekly",0]
["Scrap","2775","MB-STE-0646","Cleveland No. 2 bundles broker buying price $/per gross ton","USD","gross ton","Weekly",0]
["Scrap","2776","MB-STE-0647","Cleveland No. 1 busheling broker buying price $/per gross ton","USD","gross ton","Weekly",0]
["Scrap","2777","MB-STE-0648","Cleveland Shredded scrap broker buying price $/per gross ton","USD","gross ton","Weekly",0]
["Scrap","2778","MB-STE-0649","Cleveland Machine shop turnings broker buying price $/per gross ton","USD","gross ton","Weekly",0]
["Scrap","2779","MB-STE-0650","Cleveland Cast iron borings broker buying price $/per gross ton","USD","gross ton","Weekly",0]
["Scrap","2780","MB-STE-0651","Cleveland Plate and structurals, 5ft. and under broker buying price $/per gross ton","USD","gross ton","Weekly",0]
["Scrap","2781","MB-STE-0652","Cleveland Plate and structurals, 2ft. and under broker buying price $/per gross ton","USD","gross ton","Weekly",0]
["Scrap","2782","MB-STE-0653","Cleveland Punchings and plate broker buying price $/per gross ton","USD","gross ton","Weekly",0]
["Scrap","2783","MB-STE-0654","Cleveland Foundry steel, 2ft. and under broker buying price $/per gross ton","USD","gross ton","Weekly",0]
["Scrap","2784","MB-STE-0655","Cleveland No. 1 RR heavy melting broker buying price $/per gross ton","USD","gross ton","Weekly",0]
["Scrap","2785","MB-STE-0656","Cleveland Rails, 2ft. and under broker buying price $/per gross ton","USD","gross ton","Weekly",0]
["Scrap","2786","MB-STE-0657","Cleveland Rails, 18in. and under broker buying price $/per gross ton","USD","gross ton","Weekly",0]
["Scrap","2787","MB-STE-0658","Cleveland Drop broken machinery cast, 2ft. and under broker buying price $/per gross ton","USD","gross ton","Weekly",0]
["Scrap","2788","MB-STE-0659","Cleveland No. 1 machinery cast broker buying price $/per gross ton","USD","gross ton","Weekly",0]
["Scrap","2789","MB-STE-0660","Cleveland Mixed cast broker buying price $/per gross ton","USD","gross ton","Weekly",0]
["Scrap","2790","MB-STS-0273","Cleveland 18-8 bundles and solids broker buying price $/per gross ton","USD","gross ton","Weekly",0]
["Scrap","2791","MB-STS-0274","Cleveland 18-8 turnings broker buying price $/per gross ton","USD","gross ton","Weekly",0]
["Scrap","2792","MB-STS-0275","Cleveland 430 bundles and solids broker buying price $/per gross ton","USD","gross ton","Weekly",0]
["Scrap","2793","MB-STE-0661","Cleveland Shoveling turnings broker buying price $/per gross ton","USD","gross ton","Weekly",0]
["Scrap","2794","MB-STE-0662","Cincinnati No. 1 heavy melting broker buying price $/per gross ton","USD","gross ton","Weekly",0]
["Scrap","2795","MB-STE-0663","Cincinnati No. 2 heavy melting broker buying price $/per gross ton","USD","gross ton","Weekly",0]
["Scrap","2796","MB-STE-0664","Cincinnati No. 1 dealer bundles broker buying price $/per gross ton","USD","gross ton","Weekly",0]
["Scrap","2797","MB-STE-0665","Cincinnati No. 2 bundles broker buying price $/per gross ton","USD","gross ton","Weekly",0]
["Scrap","2798","MB-STE-0666","Cincinnati No. 1 busheling broker buying price $/per gross ton","USD","gross ton","Weekly",0]
["Scrap","2799","MB-STE-0667","Cincinnati Shredded scrap broker buying price $/per gross ton","USD","gross ton","Weekly",0]
["Scrap","2800","MB-STE-0668","Cincinnati Machine shop turnings broker buying price $/per gross ton","USD","gross ton","Weekly",0]
["Scrap","2801","MB-STE-0669","Cincinnati Cast iron borings broker buying price $/per gross ton","USD","gross ton","Weekly",0]
["Scrap","2802","MB-STE-0670","Cincinnati Plate and structurals, 5 ft. and under broker buying price $/per gross ton","USD","gross ton","Weekly",0]
["Scrap","2803","MB-STE-0671","Cincinnati Rails, random length broker buying price $/per gross ton","USD","gross ton","Weekly",0]
["Scrap","2804","MB-STE-0672","Cincinnati Rails, 2 ft. and under broker buying price $/per gross ton","USD","gross ton","Weekly",0]
["Scrap","2805","MB-STE-0673","Cincinnati No. 1 machinery cast broker buying price $/per gross ton","USD","gross ton","Weekly",0]
["Scrap","2806","MB-STE-0674","Youngstown No. 1 heavy melting broker buying price $/per gross ton","USD","gross ton","Weekly",0]
["Scrap","2807","MB-STE-0675","Youngstown No. 2 heavy melting broker buying price $/per gross ton","USD","gross ton","Weekly",0]
["Scrap","2808","MB-STE-0676","Youngstown No. 1 dealer bundles broker buying price $/per gross ton","USD","gross ton","Weekly",0]
["Scrap","2809","MB-STE-0677","Youngstown No. 2 bundles broker buying price $/per gross ton","USD","gross ton","Weekly",0]
["Scrap","2810","MB-STE-0678","Youngstown Shredded scrap broker buying price $/per gross ton","USD","gross ton","Weekly",0]
["Scrap","2811","MB-STE-0679","Youngstown Machine shop turnings broker buying price $/per gross ton","USD","gross ton","Weekly",0]
["Scrap","2812","MB-STE-0680","Youngstown Shoveling turnings broker buying price $/per gross ton","USD","gross ton","Weekly",0]
["Scrap","2813","MB-STE-0681","Youngstown Plate and structurals, 5ft. and under broker buying price $/per gross ton","USD","gross ton","Weekly",0]
["Scrap","2830","MB-STE-0698","Birmingham No. 1 heavy melting broker buying price $/per gross ton","USD","gross ton","Weekly",0]
["Scrap","2831","MB-STE-0699","Birmingham No. 2 heavy melting broker buying price $/per gross ton","USD","gross ton","Weekly",0]
["Scrap","2832","MB-STE-0700","Birmingham No. 1 dealer bundles broker buying price $/per gross ton","USD","gross ton","Weekly",0]
["Scrap","2833","MB-STE-0701","Birmingham No. 2 bundles broker buying price $/per gross ton","USD","gross ton","Weekly",0]
["Scrap","2834","MB-STE-0702","Birmingham No. 1 busheling broker buying price $/per gross ton","USD","gross ton","Weekly",0]
["Scrap","2835","MB-STE-0703","Birmingham Shredded scrap broker buying price $/per gross ton","USD","gross ton","Weekly",0]
["Scrap","2836","MB-STE-0704","Birmingham Machine shop turnings broker buying price $/per gross ton","USD","gross ton","Weekly",0]
["Scrap","2837","MB-STE-0705","Birmingham Shoveling turnings broker buying price $/per gross ton","USD","gross ton","Weekly",0]
["Scrap","2838","MB-STE-0706","Birmingham Cast iron borings broker buying price $/per gross ton","USD","gross ton","Weekly",0]
["Scrap","2839","MB-STE-0707","Birmingham Electric furnace bundles broker buying price $/per gross ton","USD","gross ton","Weekly",0]
["Scrap","2840","MB-STE-0708","Birmingham Electric furnace, 3 ft. and under broker buying price $/per gross ton","USD","gross ton","Weekly",0]
["Scrap","2841","MB-STE-0709","Birmingham Plate and structurals, 2 ft. and under broker buying price $/per gross ton","USD","gross ton","Weekly",0]
["Scrap","2842","MB-STE-0710","Birmingham Plate and structurals, 4 ft. and under broker buying price $/per gross ton","USD","gross ton","Weekly",0]
["Scrap","2843","MB-STE-0711","Birmingham No. 1 RR heavy melting broker buying price $/per gross ton","USD","gross ton","Weekly",0]
["Scrap","2844","MB-STE-0712","Birmingham Rails, random length broker buying price $/per gross ton","USD","gross ton","Weekly",0]
["Scrap","2845","MB-STE-0713","Birmingham Rails, 2 ft. and under broker buying price $/per gross ton","USD","gross ton","Weekly",0]
["Scrap","2846","MB-STE-0714","Birmingham Angles and splice bars broker buying price $/per gross ton","USD","gross ton","Weekly",0]
["Scrap","2847","MB-STE-0715","Birmingham Cupola cast broker buying price $/per gross ton","USD","gross ton","Weekly",0]
["Scrap","2848","MB-STE-0716","Birmingham Unstripped motor blocks broker buying price $/per gross ton","USD","gross ton","Weekly",0]
["Scrap","2849","MB-STE-0717","South Carolina No. 1 heavy melting consumer buying price $/per gross ton","USD","gross ton","Weekly",0]
["Scrap","2850","MB-STE-0718","South Carolina No. 2 heavy melting consumer buying price $/per gross ton","USD","gross ton","Weekly",0]
["Scrap","2851","MB-STE-0719","South Carolina No. 1 dealer bundles consumer buying price $/per gross ton","USD","gross ton","Weekly",0]
["Scrap","2852","MB-STE-0720","South Carolina No. 1 busheling consumer buying price $/per gross ton","USD","gross ton","Weekly",0]
["Scrap","2853","MB-STE-0721","South Carolina Shredded scrap consumer buying price $/per gross ton","USD","gross ton","Weekly",0]
["Scrap","2854","MB-STE-0722","South Carolina Plate and structurals, 5ft. and under consumer buying price $/per gross ton","USD","gross ton","Weekly",0]
["Scrap","2855","MB-STE-0723","South Carolina Plate and structurals, 2ft. and under consumer buying price $/per gross ton","USD","gross ton","Weekly",0]
["Scrap","2856","MB-STE-0724","South Carolina No. 1 RR heavy melting consumer buying price $/per gross ton","USD","gross ton","Weekly",0]
["Scrap","2857","MB-STE-0725","South Carolina Unstripped motor blocks consumer buying price $/per gross ton","USD","gross ton","Weekly",0]
["Scrap","2858","MB-STE-0726","New York No. 1 heavy melting export yard buying price $/per gross ton","USD","gross ton","Weekly",0]
["Scrap","2859","MB-STE-0727","New York No. 2 heavy melting export yard buying price $/per gross ton","USD","gross ton","Weekly",0]
["Scrap","2860","MB-STE-0728","New York No. 2 bundles export yard buying price $/per gross ton","USD","gross ton","Weekly",0]
["Scrap","2861","MB-STE-0729","New York Shredded scrap export yard buying price $/per gross ton","USD","gross ton","Weekly",0]
["Scrap","2862","MB-STE-0730","New York No. 1 machinery cast export yard buying price $/per gross ton","USD","gross ton","Weekly",0]
["Scrap","2863","MB-STE-0731","New York Mixed yard cast export yard buying price $/per gross ton","USD","gross ton","Weekly",0]
["Scrap","2864","MB-STS-0276","New York 18-8 bundles and solids export yard buying price $/per gross ton","USD","gross ton","Weekly",0]
["Scrap","2865","MB-STS-0277","New York 18-8 turnings export yard buying price $/per gross ton","USD","gross ton","Weekly",0]
["Scrap","2866","MB-STS-0278","New York 430 bundles and solids export yard buying price $/per gross ton","USD","gross ton","Weekly",0]
["Scrap","2867","MB-STS-0279","New York 410 bundles and solids export yard buying price $/per gross ton","USD","gross ton","Weekly",0]
["Scrap","2868","MB-STE-0732","New York No. 1 heavy melting broker buying price $/per gross ton","USD","gross ton","Weekly",0]
["Scrap","2869","MB-STE-0733","New York No. 2 heavy melting broker buying price $/per gross ton","USD","gross ton","Weekly",0]
["Scrap","2870","MB-STE-0734","New York Mixed borings and turnings broker buying price $/per gross ton","USD","gross ton","Weekly",0]
["Scrap","2871","MB-STE-0735","New York Shoveling turnings broker buying price $/per gross ton","USD","gross ton","Weekly",0]
["Scrap","2872","MB-STE-0736","New York Heavy breakable cast broker buying price $/per gross ton","USD","gross ton","Weekly",0]
["Scrap","2873","MB-STE-0737","Boston No. 1 heavy melting export yard buying price $/per gross ton","USD","gross ton","Weekly",0]
["Scrap","2874","MB-STE-0738","Boston No. 2 heavy melting export yard buying price $/per gross ton","USD","gross ton","Weekly",0]
["Scrap","2875","MB-STE-0739","Boston No. 1 dealer bundles export yard buying price $/per gross ton","USD","gross ton","Weekly",0]
["Scrap","2876","MB-STE-0740","Boston No. 2 bundles export yard buying price $/per gross ton","USD","gross ton","Weekly",0]
["Scrap","2877","MB-STE-0741","Boston No. 1 busheling export yard buying price $/per gross ton","USD","gross ton","Weekly",0]
["Scrap","2878","MB-STE-0742","Boston Shredded scrap export yard buying price $/per gross ton","USD","gross ton","Weekly",0]
["Scrap","2879","MB-STE-0743","Boston Machine shop turnings export yard buying price $/per gross ton","USD","gross ton","Weekly",0]
["Scrap","2880","MB-STE-0744","Boston Shoveling turnings export yard buying price $/per gross ton","USD","gross ton","Weekly",0]
["Scrap","2881","MB-STE-0745","Boston No. 1 machinery cast export yard buying price $/per gross ton","USD","gross ton","Weekly",0]
["Scrap","2882","MB-STE-0746","Boston Cupola cast export yard buying price $/per gross ton","USD","gross ton","Weekly",0]
["Scrap","2883","MB-STE-0747","Boston Heavy breakable cast export yard buying price $/per gross ton","USD","gross ton","Weekly",0]
["Scrap","2884","MB-STE-0748","Los Angeles No. 1 heavy melting export yard buying price $/per gross ton","USD","gross ton","Weekly",0]
["Scrap","2885","MB-STE-0749","Los Angeles Shredded scrap export yard buying price $/per gross ton","USD","gross ton","Weekly",0]
["Scrap","2886","MB-STE-0750","Los Angeles No. 1 heavy melting consumer buying price $/per gross ton","USD","gross ton","Weekly",0]
["Scrap","2887","MB-STE-0751","Los Angeles Shredded scrap consumer buying price $/per gross ton","USD","gross ton","Weekly",0]
["Scrap","2888","MB-STE-0752","Los Angeles No. 1 dealer bundles consumer buying price $/per gross ton","USD","gross ton","Weekly",0]
["Scrap","2889","MB-STE-0753","Los Angeles Machine shop turnings consumer buying price $/per gross ton","USD","gross ton","Weekly",0]
["Scrap","2890","MB-STE-0754","Los Angeles Shoveling turnings consumer buying price $/per gross ton","USD","gross ton","Weekly",0]
["Scrap","2891","MB-STE-0755","Los Angeles Electric furnace, 1 ft. and under consumer buying price $/per gross ton","USD","gross ton","Weekly",0]
["Scrap","2892","MB-STE-0756","Los Angeles Cupola cast consumer buying price $/per gross ton","USD","gross ton","Weekly",0]
["Scrap","2893","MB-STE-0757","San Francisco No. 1 heavy melting export yard buying price $/per gross ton","USD","gross ton","Weekly",0]
["Scrap","2894","MB-STE-0758","San Francisco Shredded scrap export yard buying price $/per gross ton","USD","gross ton","Weekly",0]
["Scrap","2895","MB-STE-0759","Seattle/Portland No. 1 heavy melting export yard buying price $/per gross ton","USD","gross ton","Weekly",0]
["Scrap","2896","MB-STE-0760","Seattle/Portland Shredded scrap export yard buying price $/per gross ton","USD","gross ton","Weekly",0]
["Scrap","2897","MB-STE-0761","Seattle/Portland No. 1 heavy melting consumer buying price $/per gross ton","USD","gross ton","Weekly",0]
["Scrap","2898","MB-STE-0762","Seattle/Portland Shredded scrap consumer buying price $/per gross ton","USD","gross ton","Weekly",0]
["Scrap","2899","MB-STE-0763","Seattle/Portland No. 2 bundles consumer buying price $/per gross ton","USD","gross ton","Weekly",0]
["Scrap","2900","MB-STE-0764","Seattle/Portland Mixed yard cast consumer buying price $/per gross ton","USD","gross ton","Weekly",0]
["Scrap","2901","MB-STE-0765","Houston No. 1 heavy melting broker buying price $/per gross ton","USD","gross ton","Weekly",0]
["Scrap","2902","MB-STE-0766","Houston No. 2 heavy melting broker buying price $/per gross ton","USD","gross ton","Weekly",0]
["Scrap","2903","MB-STE-0767","Houston No. 1 busheling broker buying price $/per gross ton","USD","gross ton","Weekly",0]
["Scrap","2904","MB-STE-0768","Houston Shredded scrap broker buying price $/per gross ton","USD","gross ton","Weekly",0]
["Scrap","2905","MB-STE-0769","Houston Machine shop turnings broker buying price $/per gross ton","USD","gross ton","Weekly",0]
["Scrap","2906","MB-STE-0770","Houston Plate and structurals, 5 ft. and under broker buying price $/per gross ton","USD","gross ton","Weekly",0]
["Scrap","2907","MB-STE-0771","Houston Unstripped motor blocks broker buying price $/per gross ton","USD","gross ton","Weekly",0]
["Scrap","2908","MB-STE-0772","Hamilton No. 1 heavy melting broker buying price Canadian $/per net ton","CAD","net ton","Weekly",0]
["Scrap","2909","MB-STE-0773","Hamilton No. 1 dealer bundles broker buying price Canadian $/per net ton","CAD","net ton","Weekly",0]
["Scrap","2910","MB-STE-0774","Hamilton No. 1 busheling broker buying price Canadian $/per net ton","CAD","net ton","Weekly",0]
["Scrap","2911","MB-STE-0775","Hamilton Busheling, unprepared broker buying price Canadian $/per net ton","CAD","net ton","Weekly",0]
["Scrap","2912","MB-STE-0776","Hamilton Shredded scrap broker buying price Canadian $/per net ton","CAD","net ton","Weekly",0]
["Scrap","2913","MB-STE-0777","Hamilton Machine shop turnings broker buying price Canadian $/per net ton","CAD","net ton","Weekly",0]
["Scrap","2914","MB-STE-0778","Hamilton Cast iron borings broker buying price Canadian $/per net ton","CAD","net ton","Weekly",0]
["Scrap","2915","MB-STE-0779","Hamilton Cast scrap broker buying price Canadian $/per net ton","CAD","net ton","Weekly",0]
["Scrap","2920","MB-NI-0144","Buffalo No. 1 machinery cast broker buying price $/per gross ton","USD","gross ton","Weekly",0]
["Scrap","2921","MB-NI-0145","Buffalo Old aluminum sheet & cast scrap dealer buying price delivered to yard cents/lb","US Cents","pound","twice monthly",0]
["Scrap","2922","MB-NI-0146","Buffalo Mixed Yellow brass turnings, borings scrap dealer buying price delivered to yard cents/lb","US Cents","pound","twice monthly",0]
["Scrap","2923","MB-NI-0147","Buffalo No. 1 dealer bundles broker buying price $/per gross ton","USD","gross ton","Weekly",0]
["Scrap","2924","MB-NI-0148","Buffalo Mixed borings and turnings broker buying price $/per gross ton","USD","gross ton","Weekly",0]
["Scrap","2925","MB-NI-0149","Buffalo Cocks & faucets scrap dealer buying price delivered to yard cents/lb","US Cents","pound","twice monthly",0]
["Scrap","2926","MB-NI-0150","Buffalo 304 turnings stainless steel scrap dealer buying price cents/lb","US Cents","pound","Weekly",0]
["Scrap","2927","MB-NI-0151","Buffalo 63S Aluminum solids scrap dealer buying price delivered to yard cents/lb","US Cents","pound","twice monthly",0]
["Scrap","2928","MB-NI-0152","Buffalo Aluminum utensils scrap dealer buying price delivered to yard cents/lb","US Cents","pound","twice monthly",0]
["Scrap","2929","MB-NI-0153","Buffalo Machine shop turnings dealer selling price $/gross ton","USD","gross ton","Monthly",0]
["Scrap","2930","MB-NI-0154","Buffalo High-grade bronze gears scrap dealer buying price delivered to yard cents/lb","US Cents","pound","twice monthly",0]
["Scrap","2931","MB-NI-0155","Buffalo 304 new clips dealer buying price cents/lb","US Cents","pound","Weekly",0]
["Scrap","2932","MB-NI-0156","Buffalo No. 2 bundles broker buying price $/per gross ton","USD","gross ton","Weekly",0]
["Scrap","2933","MB-NI-0157","Buffalo old zinc die cast scrap delivered to yard cents/lb","US Cents","pound","twice monthly",0]
["Scrap","2934","MB-NI-0158","Buffalo New zinc die cast scrap delivered to yard cents/lb","US Cents","pound","twice monthly",0]
["Scrap","2935","MB-NI-0159","Buffalo No. 1 heavy copper & wire dealer buying price delivered to yard cents/lb","US Cents","pound","twice monthly",0]
["Scrap","2936","MB-NI-0160","Buffalo Mixed Clips scrap dealer buying price delivered to yard cents/lb","US Cents","pound","twice monthly",0]
["Scrap","2937","MB-NI-0161","Buffalo Cupola cast broker buying price $/per gross ton","USD","gross ton","Weekly",0]
["Scrap","2938","MB-NI-0162","Buffalo 304 turnings, dealer buying, $ per gross ton","USD","gross ton","Weekly",0]
["Scrap","2939","MB-NI-0163","Buffalo 70-30 Brass Clips scrap scrap dealer buying price delivered to yard cents/lb","US Cents","pound","twice monthly",0]
["Scrap","2940","MB-NI-0164","Buffalo Auto radiators (unsweated) scrap dealer buying price delivered to yard cents/lb","US Cents","pound","twice monthly",0]
["Scrap","2941","MB-NI-0165","Buffalo Manganese bronze solids scrap dealer buying price delivered to yard cents/lb","US Cents","pound","twice monthly",0]
["Scrap","2942","MB-NI-0166","Buffalo Industrial castings scrap dealer buying price delivered to yard cents/lb","US Cents","pound","twice monthly",0]
["Scrap","2943","MB-NI-0167","Buffalo 304 new clips, dealer buying, $ per gross ton","USD","gross ton","Weekly",0]
["Scrap","2944","MB-NI-0168","Buffalo No. 2 heavy copper & wire dealer buying price delivered to yard cents/lb","US Cents","pound","twice monthly",0]
["Scrap","2945","MB-NI-0169","Buffalo old zinc scrap delivered to yard cents/lb","US Cents","pound","twice monthly",0]
["Scrap","2946","MB-NI-0170","Buffalo No. 1 busheling broker buying price $/per gross ton","USD","gross ton","Weekly",0]
["Scrap","2947","MB-NI-0171","Buffalo No. 1 heavy melt scrap dealer selling price $/gross ton","USD","gross ton","Monthly",0]
["Scrap","2948","MB-NI-0172","Buffalo Mixed hard lead scrap dealer buying price delivered to yard cents/lb","US Cents","pound","twice monthly",0]
["Scrap","2949","MB-NI-0173","Buffalo Cut structural/plate 5ft. max. dealer selling price $/gross ton","USD","gross ton","Monthly",0]
["Scrap","2950","MB-NI-0174","Buffalo 316 solids, clips dealer buying price cents/lb","US Cents","pound","Weekly",0]
["Scrap","2951","MB-NI-0175","Buffalo 75S Aluminum clips scrap dealer buying price delivered to yard cents/lb","US Cents","pound","twice monthly",0]
["Scrap","2952","MB-NI-0176","Buffalo Brass pipe scrap dealer buying price delivered to yard cents/lb","US Cents","pound","twice monthly",0]
["Scrap","2953","MB-NI-0177","Buffalo Manganese bronze turnings scrap dealer buying price delivered to yard cents/lb","US Cents","pound","twice monthly",0]
["Scrap","2954","MB-NI-0178","Buffalo Light copper scrap dealer buying price delivered to yard cents/lb","US Cents","pound","twice monthly",0]
["Scrap","2955","MB-NI-0179","Buffalo 304 solids, clips stainless steel scrap dealerbuying price cents/lb","US Cents","pound","Weekly",0]
["Scrap","2956","MB-NI-0180","Buffalo No. 2 heavy melting broker buying price $/per gross ton","USD","gross ton","Weekly",0]
["Scrap","2957","MB-NI-0181","Buffalo Painted aluminum siding scrap dealer buying price delivered to yard cents/lb","US Cents","pound","twice monthly",0]
["Scrap","2958","MB-NI-0182","Buffalo No. 1 busheling scrap dealer selling price $/gross ton","USD","gross ton","Monthly",0]
["Scrap","2959","MB-NI-0183","Buffalo No. 1 heavy melting broker buying price $/per gross ton","USD","gross ton","Weekly",0]
["Scrap","2960","MB-NI-0184","Buffalo Mixed low-copper clips scrap dealer buying price delivered to yard cents/lb","US Cents","pound","twice monthly",0]
["Scrap","2961","MB-NI-0185","Buffalo Heavy soft lead scrap dealer buying price delivered to yard cents/lb","US Cents","pound","twice monthly",0]
["Scrap","2962","MB-NI-0186","Buffalo 316 solids, clips, dealer buying, $ per gross ton","USD","gross ton","Weekly",0]
["Scrap","2963","MB-NI-0187","Buffalo Aluminum borings, turnings, clean & dry scrap dealer buying price cents/lb delivered to yard","US Cents","pound","twice monthly",0]
["Scrap","2964","MB-NI-0188","Buffalo Cast iron borings broker buying price $/per gross ton","USD","gross ton","Weekly",0]
["Scrap","2965","MB-NI-0189","Buffalo Misc. nickel-\"silver\" solids scrap scrap dealer buying price delivered to yard cents/lb","US Cents","pound","twice monthly",0]
["Scrap","2966","MB-NI-0190","Buffalo Machine shop turnings broker buying price $/per gross ton","USD","gross ton","Weekly",0]
["Scrap","2967","MB-NI-0191","Buffalo 304 solids, clips, dealer buying, $ per gross ton","USD","gross ton","Weekly",0]
["Scrap","2968","MB-NI-0192","Broker nickel scrap solids - Chicago US cents per pound","US Cents","pound","twice monthly",0]
["Scrap","2969","MB-NI-0193","Broker nickel turnings scrap - Chicago US cents per pound","US Cents","pound","twice monthly",0]
["Scrap","2970","MB-NI-0194","Broker Monel R-400 scrap solids, clips - Chicago US cents per pound","US Cents","pound","twice monthly",0]
["Scrap","2971","MB-NI-0195","Broker Monel scrap turnings - Chicago US cents per pound","US Cents","pound","twice monthly",0]
["Scrap","2972","MB-NI-0196","Broker Monel K-500 (castings) solids, clips - Chicago US cents per pound","US Cents","pound","twice monthly",0]
["Scrap","2973","MB-NI-0197","Broker Inconel 600 scrap solids, clips - Chicago US cents per pound","US Cents","pound","twice monthly",0]
["Scrap","2974","MB-NI-0198","Broker 309 stainless steel scrap solids - Chicago US cents per pound","US Cents","pound","twice monthly",0]
["Scrap","2975","MB-NI-0199","Broker 310 stainless steel scrap solids - Chicago US cents per pound","US Cents","pound","twice monthly",0]
["Scrap","2976","MB-NI-0200","Broker 330 stainless steel scrap solids - Chicago US cents per pound","US Cents","pound","twice monthly",0]
["Scrap","2977","MB-NI-0201","Broker Invar scrap solids, clips - Chicago US cents per pound","US Cents","pound","twice monthly",0]
["Scrap","2978","MB-NI-0202","Broker Inconel 601 scrap solids, clips - Chicago US cents per pound","US Cents","pound","twice monthly",0]
["Scrap","2979","MB-NI-0203","Broker 17-4PH solids - Chicago US cents per pound","US Cents","pound","twice monthly",0]
["Scrap","2980","MB-NI-0204","Broker nickel scrap solids - Detroit US cents per pound","US Cents","pound","twice monthly",0]
["Scrap","2981","MB-NI-0205","Broker nickel turnings scrap - Detroit US cents per pound","US Cents","pound","twice monthly",0]
["Scrap","2982","MB-NI-0206","Broker Monel R-400 scrap solids, clips - Detroit US cents per pound","US Cents","pound","twice monthly",0]
["Scrap","2983","MB-NI-0207","Broker Monel scrap turnings - Detroit US cents per pound","US Cents","pound","twice monthly",0]
["Scrap","2984","MB-NI-0208","Broker Monel K-500 (castings) solids, clips - Detroit US cents per pound","US Cents","pound","twice monthly",0]
["Scrap","2985","MB-NI-0209","Broker Inconel 600 scrap solids, clips - Detroit US cents per pound","US Cents","pound","twice monthly",0]
["Scrap","2986","MB-NI-0210","Broker 309 stainless steel scrap solids - Detroit US cents per pound","US Cents","pound","twice monthly",0]
["Scrap","2987","MB-NI-0211","Broker 310 stainless steel scrap solids - Detroit US cents per pound","US Cents","pound","twice monthly",0]
["Scrap","2988","MB-NI-0212","Broker 330 stainless steel scrap solids - Detroit US cents per pound","US Cents","pound","twice monthly",0]
["Scrap","2989","MB-NI-0213","Broker Invar scrap solids, clips - Detroit US cents per pound","US Cents","pound","twice monthly",0]
["Scrap","2990","MB-NI-0214","Broker Inconel 601 scrap solids, clips - Detroit US cents per pound","US Cents","pound","twice monthly",0]
["Scrap","2991","MB-NI-0215","Broker 17-4PH solids - Detroit US cents per pound","US Cents","pound","twice monthly",0]
["Scrap","2992","MB-NI-0216","Broker nickel scrap solids - Houston US cents per pound","US Cents","pound","twice monthly",0]
["Scrap","2993","MB-NI-0217","Broker nickel turnings scrap - Houston US cents per pound","US Cents","pound","twice monthly",0]
["Scrap","2994","MB-NI-0218","Broker Monel R-400 scrap solids, clips - Houston US cents per pound","US Cents","pound","twice monthly",0]
["Scrap","2995","MB-NI-0219","Broker Monel scrap turnings - Houston US cents per pound","US Cents","pound","twice monthly",0]
["Scrap","2996","MB-NI-0220","Broker Monel K-500 (castings) solids, clips - Houston US cents per pound","US Cents","pound","twice monthly",0]
["Scrap","2997","MB-NI-0221","Broker Inconel 600 scrap solids, clips - Houston US cents per pound","US Cents","pound","twice monthly",0]
["Scrap","2998","MB-NI-0222","Broker 309 stainless steel scrap solids - Houston US cents per pound","US Cents","pound","twice monthly",0]
["Scrap","2999","MB-NI-0223","Broker 310 stainless steel scrap solids - Houston US cents per pound","US Cents","pound","twice monthly",0]
["Scrap","3000","MB-NI-0224","Broker 330 stainless steel scrap solids - Houston US cents per pound","US Cents","pound","twice monthly",0]
["Scrap","3001","MB-NI-0225","Broker Invar scrap solids, clips - Houston US cents per pound","US Cents","pound","twice monthly",0]
["Scrap","3002","MB-NI-0226","Broker Inconel 601 scrap solids, clips - Houston US cents per pound","US Cents","pound","twice monthly",0]
["Scrap","3003","MB-NI-0227","Broker 17-4PH solids - Houston US cents per pound","US Cents","pound","twice monthly",0]
["Scrap","3004","MB-NI-0228","Broker nickel scrap solids - Pittsburgh US cents per pound","US Cents","pound","twice monthly",0]
["Scrap","3005","MB-NI-0229","Broker nickel turnings scrap - Pittsburgh US cents per pound","US Cents","pound","twice monthly",0]
["Scrap","3006","MB-NI-0230","Broker Monel R-400 scrap solids, clips - Pittsburgh US cents per pound","US Cents","pound","twice monthly",0]
["Scrap","3007","MB-NI-0231","Broker Monel scrap turnings - Pittsburgh US cents per pound","US Cents","pound","twice monthly",0]
["Scrap","3008","MB-NI-0232","Broker Monel K-500 (castings) solids, clips - Pittsburgh US cents per pound","US Cents","pound","twice monthly",0]
["Scrap","3009","MB-NI-0233","Broker Inconel 600 scrap solids, clips - Pittsburgh US cents per pound","US Cents","pound","twice monthly",0]
["Scrap","3010","MB-NI-0234","Broker 309 stainless steel scrap solids - Pittsburgh US cents per pound","US Cents","pound","twice monthly",0]
["Scrap","3011","MB-NI-0235","Broker 310 stainless steel scrap solids - Pittsburgh US cents per pound","US Cents","pound","twice monthly",0]
["Scrap","3012","MB-NI-0236","Broker 330 stainless steel scrap solids - Pittsburgh US cents per pound","US Cents","pound","twice monthly",0]
["Scrap","3013","MB-NI-0237","Broker Invar scrap solids, clips - Pittsburgh US cents per pound","US Cents","pound","twice monthly",0]
["Scrap","3014","MB-NI-0238","Broker Inconel 601 scrap solids, clips - Pittsburgh US cents per pound","US Cents","pound","twice monthly",0]
["Scrap","3015","MB-NI-0239","Broker 17-4PH solids - Pittsburgh US cents per pound","US Cents","pound","twice monthly",0]
["Scrap","308","MB-PB-0002","Cable lead scrap US smelters buying price $/CWT","USD","cwt","twice monthly",0]
["Scrap","309","MB-PB-0003","Remelt lead scrap US smelters buying price $/CWT","USD","cwt","twice monthly",0]
["Scrap","310","MB-PB-0004","Lead scrap US smelters buying price $/CWT","USD","cwt","twice monthly",0]
["Scrap","311","MB-PB-0005","Whole batteries lead scrap US smelters buying price $/CWT","USD","cwt","twice monthly",0]
["Scrap","312","MB-ZN-0002","Galvanizers dross zinc scrap US smelters buying price cents/lb","US Cents","pound","twice monthly",0]
["Scrap","313","MB-ZN-0003","New zinc clippings zinc scrap US smelters buying price cents/lb","US Cents","pound","twice monthly",0]
["Scrap","314","MB-ZN-0004","Old Zinc (clean) zinc scrap US smelters buying price cents/lb","US Cents","pound","twice monthly",0]
["Scrap","350","MB-AL-0023","Mixed low copper clips aluminum scrap buying price delivered to Midwest secondary smelters cents/lb","US Cents","pound","weekly",0]
["Scrap","351","MB-AL-0024","Mixed high copper clips aluminum scrap buying price delivered to Midwest secondary smelters cents/lb","US Cents","pound","weekly",0]
["Scrap","352","MB-AL-0025","Mixed high zinc clips aluminum scrap buying price delivered to Midwest secondary smelters cents/lb","US Cents","pound","weekly",0]
["Scrap","354","MB-AL-0027","Siding aluminum scrap buying price delivered to Midwest secondary smelters cents/lb","US Cents","pound","weekly",0]
["Scrap","355","MB-AL-0028","Mixed clips aluminum scrap buying price delivered to Midwest secondary smelters cents/lb","US Cents","pound","weekly",0]
["Scrap","356","MB-AL-0029","Old Sheet aluminum scrap buying price delivered to Midwest secondary smelters cents/lb","US Cents","pound","weekly",0]
["Scrap","357","MB-AL-0030","Old Cast aluminum scrap buying price delivered to Midwest secondary smelters cents/lb","US Cents","pound","weekly",0]
["Scrap","358","MB-AL-0031","Turnings clean dry high grade aluminum scrap buying price delivered to Midwest secondary smelters cents/lb","US Cents","pound","weekly",0]
["Scrap","359","MB-AL-0032","Turnings clean dry mixed grade (max 5% Zn) aluminum scrap buying price delivered to Midwest secondary smelters cents/lb","US Cents","pound","weekly",0]
["Scrap","360","MB-AL-0033","Aluminum-copper radiators aluminum scrap buying price delivered to Midwest secondary smelters cents/lb","US Cents","pound","weekly",0]
["Scrap","361","MB-AL-0034","Nonferrous auto shred (90% Al) aluminum scrap buying price delivered to Midwest secondary smelters cents/lb","US Cents","pound","weekly",0]
["Scrap","362","MB-AL-0035","Used beverage can aluminum scrap domestic aluminum producer buying prices FOB shipping point carload lots cents/lb","US Cents","pound","weekly",0]
["Scrap","363","MB-AL-0036","Segregated low copper alloy clips 5052 aluminum scrap FOB shipping point, mills, specialty consumers' buying price cents/lb","US Cents","pound","weekly",0]
["Scrap","364","MB-AL-0037","Segregated low copper alloy clips 3105 aluminum scrap FOB shipping point, mills, specialty consumers' buying price cents/lb","US Cents","pound","weekly",0]
["Scrap","365","MB-AL-0038","Mixed low copper alloy clips aluminum scrap FOB shipping point, mills, specialty consumers' buying price cents/lb","US Cents","pound","weekly",0]
["Scrap","366","MB-AL-0039","Painted siding aluminum scrap FOB shipping point, mills, specialty consumers' buying price cents/lb","US Cents","pound","weekly",0]
["Scrap","446","MB-CU-0009","Montreal No. 1 heavy copper & wire dealer buying price delivered to yard cents/lb","CA Cents","pound","twice monthly",0]
["Scrap","447","MB-CU-0010","Toronto No. 1 heavy copper & wire dealer buying price delivered to yard cents/lb","CA Cents","pound","twice monthly",0]
["Scrap","449","MB-CU-0012","Boston No. 1 heavy copper & wire dealer buying price delivered to yard cents/lb","US Cents","pound","twice monthly",0]
["Scrap","450","MB-CU-0013","New York No. 1 heavy copper & wire dealer buying price delivered to yard cents/lb","US Cents","pound","twice monthly",0]
["Scrap","451","MB-CU-0014","Philadelphia No. 1 heavy copper & wire dealer buying price delivered to yard cents/lb","US Cents","pound","twice monthly",0]
["Scrap","452","MB-CU-0015","Atlanta No. 1 heavy copper & wire dealer buying price delivered to yard cents/lb","US Cents","pound","twice monthly",0]
["Scrap","453","MB-CU-0016","Houston No. 1 heavy copper & wire dealer buying price delivered to yard cents/lb","US Cents","pound","twice monthly",0]
["Scrap","454","MB-CU-0017","Pittsburgh No. 1 heavy copper & wire dealer buying price delivered to yard cents/lb","US Cents","pound","twice monthly",0]
["Scrap","455","MB-CU-0018","Cleveland No. 1 heavy copper & wire dealer buying price delivered to yard cents/lb","US Cents","pound","twice monthly",0]
["Scrap","456","MB-CU-0019","Cincinnati No. 1 heavy copper & wire dealer buying price delivered to yard cents/lb","US Cents","pound","twice monthly",0]
["Scrap","457","MB-CU-0020","Detroit No. 1 heavy copper & wire dealer buying price delivered to yard cents/lb","US Cents","pound","twice monthly",0]
["Scrap","458","MB-CU-0021","Chicago No. 1 heavy copper & wire dealer buying price delivered to yard cents/lb","US Cents","pound","twice monthly",0]
["Scrap","459","MB-CU-0022","St Louis No. 1 heavy copper & wire dealer buying price delivered to yard cents/lb","US Cents","pound","twice monthly",0]
["Scrap","460","MB-CU-0023","San Francisco No. 1 heavy copper & wire dealer buying price delivered to yard cents/lb","US Cents","pound","twice monthly",0]
["Scrap","461","MB-CU-0024","Los Angeles No. 1 heavy copper & wire dealer buying price delivered to yard cents/lb","US Cents","pound","twice monthly",0]
["Scrap","462","MB-CU-0025","Montreal No. 2 heavy copper & wire dealer buying price delivered to yard cents/lb","CA Cents","pound","twice monthly",0]
["Scrap","463","MB-CU-0026","Toronto No. 2 heavy copper & wire dealer buying price delivered to yard cents/lb","CA Cents","pound","twice monthly",0]
["Scrap","465","MB-CU-0028","Boston No. 2 heavy copper & wire dealer buying price delivered to yard cents/lb","US Cents","pound","twice monthly",0]
["Scrap","466","MB-CU-0029","New York No. 2 heavy copper & wire dealer buying price delivered to yard cents/lb","US Cents","pound","twice monthly",0]
["Scrap","467","MB-CU-0030","Philadelphia No. 2 heavy copper & wire dealer buying price delivered to yard cents/lb","US Cents","pound","twice monthly",0]
["Scrap","468","MB-CU-0031","Atlanta No. 2 heavy copper & wire dealer buying price delivered to yard cents/lb","US Cents","pound","twice monthly",0]
["Scrap","469","MB-CU-0032","Houston No. 2 heavy copper & wire dealer buying price delivered to yard cents/lb","US Cents","pound","twice monthly",0]
["Scrap","470","MB-CU-0033","Pittsburgh No. 2 heavy copper & wire dealer buying price delivered to yard cents/lb","US Cents","pound","twice monthly",0]
["Scrap","471","MB-CU-0034","Cleveland No. 2 heavy copper & wire dealer buying price delivered to yard cents/lb","US Cents","pound","twice monthly",0]
["Scrap","472","MB-CU-0035","Cincinnati No. 2 heavy copper & wire dealer buying price delivered to yard cents/lb","US Cents","pound","twice monthly",0]
["Scrap","473","MB-CU-0036","Detroit No. 2 heavy copper & wire dealer buying price delivered to yard cents/lb","US Cents","pound","twice monthly",0]
["Scrap","474","MB-CU-0037","Chicago No. 2 heavy copper & wire dealer buying price delivered to yard cents/lb","US Cents","pound","twice monthly",0]
["Scrap","475","MB-CU-0038","St Louis No. 2 heavy copper & wire dealer buying price delivered to yard cents/lb","US Cents","pound","twice monthly",0]
["Scrap","476","MB-CU-0039","San Francisco No. 2 heavy copper & wire dealer buying price delivered to yard cents/lb","US Cents","pound","twice monthly",0]
["Scrap","477","MB-CU-0040","Los Angeles No. 2 heavy copper & wire dealer buying price delivered to yard cents/lb","US Cents","pound","twice monthly",0]
["Scrap","478","MB-CU-0041","Montreal Light copper scrap dealer buying price delivered to yard cents/lb","CA Cents","pound","twice monthly",0]
["Scrap","479","MB-CU-0042","Toronto Light copper scrap dealer buying price delivered to yard cents/lb","CA Cents","pound","twice monthly",0]
["Scrap","481","MB-CU-0044","Boston Light copper scrap dealer buying price delivered to yard cents/lb","US Cents","pound","twice monthly",0]
["Scrap","482","MB-CU-0045","New York Light copper scrap dealer buying price delivered to yard cents/lb","US Cents","pound","twice monthly",0]
["Scrap","483","MB-CU-0046","Philadelphia Light copper scrap dealer buying price delivered to yard cents/lb","US Cents","pound","twice monthly",0]
["Scrap","484","MB-CU-0047","Atlanta Light copper scrap dealer buying price delivered to yard cents/lb","US Cents","pound","twice monthly",0]
["Scrap","485","MB-CU-0048","Houston Light copper scrap dealer buying price delivered to yard cents/lb","US Cents","pound","twice monthly",0]
["Scrap","486","MB-CU-0049","Pittsburgh Light copper scrap dealer buying price delivered to yard cents/lb","US Cents","pound","twice monthly",0]
["Scrap","487","MB-CU-0050","Cleveland Light copper scrap dealer buying price delivered to yard cents/lb","US Cents","pound","twice monthly",0]
["Scrap","488","MB-CU-0051","Cincinnati Light copper scrap dealer buying price delivered to yard cents/lb","US Cents","pound","twice monthly",0]
["Scrap","489","MB-CU-0052","Detroit Light copper scrap dealer buying price delivered to yard cents/lb","US Cents","pound","twice monthly",0]
["Scrap","490","MB-CU-0053","Chicago Light copper scrap dealer buying price delivered to yard cents/lb","US Cents","pound","twice monthly",0]
["Scrap","491","MB-CU-0054","St Louis Light copper scrap dealer buying price delivered to yard cents/lb","US Cents","pound","twice monthly",0]
["Scrap","492","MB-CU-0055","San Francisco Light copper scrap dealer buying price delivered to yard cents/lb","US Cents","pound","twice monthly",0]
["Scrap","493","MB-CU-0056","Los Angeles Light copper scrap dealer buying price delivered to yard cents/lb","US Cents","pound","twice monthly",0]
["Scrap","494","MB-CU-0057","Montreal Red brass solids scrap dealer buying price delivered to yard Canadian cents/lb","CA Cents","pound","twice monthly",0]
["Scrap","495","MB-CU-0058","Toronto Red brass solids scrap dealer buying price delivered to yard Canadian cents/lb","CA Cents","pound","twice monthly",0]
["Scrap","497","MB-CU-0060","Boston Red brass solids scrap dealer buying price delivered to yard cents/lb","US Cents","pound","twice monthly",0]
["Scrap","498","MB-CU-0061","New York Red brass solids scrap dealer buying price delivered to yard cents/lb","US Cents","pound","twice monthly",0]
["Scrap","499","MB-CU-0062","Philadelphia Red brass solids scrap dealer buying price delivered to yard cents/lb","US Cents","pound","twice monthly",0]
["Scrap","500","MB-CU-0063","Atlanta Red brass solids scrap dealer buying price delivered to yard cents/lb","US Cents","pound","twice monthly",0]
["Scrap","501","MB-CU-0064","Houston Red brass solids scrap dealer buying price delivered to yard cents/lb","US Cents","pound","twice monthly",0]
["Scrap","502","MB-CU-0065","Pittsburgh Red brass solids scrap dealer buying price delivered to yard cents/lb","US Cents","pound","twice monthly",0]
["Scrap","503","MB-CU-0066","Cleveland Red brass solids scrap dealer buying price delivered to yard cents/lb","US Cents","pound","twice monthly",0]
["Scrap","504","MB-CU-0067","Cincinnati Red brass solids scrap dealer buying price delivered to yard cents/lb","US Cents","pound","twice monthly",0]
["Scrap","505","MB-CU-0068","Detroit Red brass solids scrap dealer buying price delivered to yard cents/lb","US Cents","pound","twice monthly",0]
["Scrap","506","MB-CU-0069","Chicago Red brass solids scrap dealer buying price delivered to yard cents/lb","US Cents","pound","twice monthly",0]
["Scrap","507","MB-CU-0070","St Louis Red brass solids scrap dealer buying price delivered to yard cents/lb","US Cents","pound","twice monthly",0]
["Scrap","508","MB-CU-0071","San Francisco Red brass solids scrap dealer buying price delivered to yard cents/lb","US Cents","pound","twice monthly",0]
["Scrap","509","MB-CU-0072","Los Angeles Red brass solids scrap dealer buying price delivered to yard cents/lb","US Cents","pound","twice monthly",0]
["Scrap","510","MB-CU-0073","Montreal Red brass turnings, borings scrap dealer buying price delivered to yard cents/lb","CA Cents","pound","twice monthly",0]
["Scrap","511","MB-CU-0074","Toronto Red brass turnings, borings scrap dealer buying price delivered to yard cents/lb","CA Cents","pound","twice monthly",0]
["Scrap","513","MB-CU-0076","Boston Red brass turnings, borings scrap dealer buying price delivered to yard cents/lb","US Cents","pound","twice monthly",0]
["Scrap","514","MB-CU-0077","New York Red brass turnings, borings scrap dealer buying price delivered to yard cents/lb","US Cents","pound","twice monthly",0]
["Scrap","515","MB-CU-0078","Philadelphia Red brass turnings, borings scrap dealer buying price delivered to yard cents/lb","US Cents","pound","twice monthly",0]
["Scrap","516","MB-CU-0079","Atlanta Red brass turnings, borings scrap dealer buying price delivered to yard cents/lb","US Cents","pound","twice monthly",0]
["Scrap","517","MB-CU-0080","Houston Red brass turnings, borings scrap dealer buying price delivered to yard cents/lb","US Cents","pound","twice monthly",0]
["Scrap","518","MB-CU-0081","Pittsburgh Red brass turnings, borings scrap dealer buying price delivered to yard cents/lb","US Cents","pound","twice monthly",0]
["Scrap","519","MB-CU-0082","Cleveland Red brass turnings, borings scrap dealer buying price delivered to yard cents/lb","US Cents","pound","twice monthly",0]
["Scrap","520","MB-CU-0083","Cincinnati Red brass turnings, borings scrap dealer buying price delivered to yard cents/lb","US Cents","pound","twice monthly",0]
["Scrap","521","MB-CU-0084","Detroit Red brass turnings, borings scrap dealer buying price delivered to yard cents/lb","US Cents","pound","twice monthly",0]
["Scrap","522","MB-CU-0085","Chicago Red brass turnings, borings scrap dealer buying price delivered to yard cents/lb","US Cents","pound","twice monthly",0]
["Scrap","523","MB-CU-0086","St Louis Red brass turnings, borings scrap dealer buying price delivered to yard cents/lb","US Cents","pound","twice monthly",0]
["Scrap","524","MB-CU-0087","San Francisco Red brass turnings, borings scrap dealer buying price delivered to yard cents/lb","US Cents","pound","twice monthly",0]
["Scrap","525","MB-CU-0088","Los Angeles Red brass turnings, borings scrap dealer buying price delivered to yard cents/lb","US Cents","pound","twice monthly",0]
["Scrap","526","MB-CU-0089","Montreal Cocks & faucets scrap dealer buying price delivered to yard Canadian cents/lb","CA Cents","pound","twice monthly",0]
["Scrap","527","MB-CU-0090","Toronto Cocks & faucets scrap dealer buying price delivered to yard Canadian cents/lb","CA Cents","pound","twice monthly",0]
["Scrap","529","MB-CU-0092","New York Cocks & faucets scrap dealer buying price delivered to yard cents/lb","US Cents","pound","twice monthly",0]
["Scrap","530","MB-CU-0093","Philadelphia Cocks & faucets scrap dealer buying price delivered to yard cents/lb","US Cents","pound","twice monthly",0]
["Scrap","531","MB-CU-0094","Atlanta Cocks & faucets scrap dealer buying price delivered to yard cents/lb","US Cents","pound","twice monthly",0]
["Scrap","532","MB-CU-0095","Houston Cocks & faucets scrap dealer buying price delivered to yard cents/lb","US Cents","pound","twice monthly",0]
["Scrap","533","MB-CU-0096","Pittsburgh Cocks & faucets scrap dealer buying price delivered to yard cents/lb","US Cents","pound","twice monthly",0]
["Scrap","534","MB-CU-0097","Cleveland Cocks & faucets scrap dealer buying price delivered to yard cents/lb","US Cents","pound","twice monthly",0]
["Scrap","535","MB-CU-0098","Cincinnati Cocks & faucets scrap dealer buying price delivered to yard cents/lb","US Cents","pound","twice monthly",0]
["Scrap","536","MB-CU-0099","Detroit Cocks & faucets scrap dealer buying price delivered to yard cents/lb","US Cents","pound","twice monthly",0]
["Scrap","537","MB-CU-0100","Chicago Cocks & faucets scrap dealer buying price delivered to yard cents/lb","US Cents","pound","twice monthly",0]
["Scrap","538","MB-CU-0101","St Louis Cocks & faucets scrap dealer buying price delivered to yard cents/lb","US Cents","pound","twice monthly",0]
["Scrap","539","MB-CU-0102","San Francisco Cocks & faucets scrap dealer buying price delivered to yard cents/lb","US Cents","pound","twice monthly",0]
["Scrap","540","MB-CU-0103","Los Angeles Cocks & faucets scrap dealer buying price delivered to yard cents/lb","US Cents","pound","twice monthly",0]
["Scrap","541","MB-CU-0104","Montreal Brass pipe scrap scrap dealer buying price delivered to yard cents/lb","CA Cents","pound","twice monthly",0]
["Scrap","543","MB-CU-0106","Boston Brass pipe scrap dealer buying price delivered to yard cents/lb","US Cents","pound","twice monthly",0]
["Scrap","544","MB-CU-0107","New York Brass pipe scrap dealer buying price delivered to yard cents/lb","US Cents","pound","twice monthly",0]
["Scrap","545","MB-CU-0108","Philadelphia Brass pipe scrap dealer buying price delivered to yard cents/lb","US Cents","pound","twice monthly",0]
["Scrap","546","MB-CU-0109","Atlanta Brass pipe scrap dealer buying price delivered to yard cents/lb","US Cents","pound","twice monthly",0]
["Scrap","547","MB-CU-0110","Houston Brass pipe scrap dealer buying price delivered to yard cents/lb","US Cents","pound","twice monthly",0]
["Scrap","548","MB-CU-0111","Pittsburgh Brass pipe scrap dealer buying price delivered to yard cents/lb","US Cents","pound","twice monthly",0]
["Scrap","549","MB-CU-0112","Cleveland Brass pipe scrap dealer buying price delivered to yard cents/lb","US Cents","pound","twice monthly",0]
["Scrap","550","MB-CU-0113","Cincinnati Brass pipe scrap dealer buying price delivered to yard cents/lb","US Cents","pound","twice monthly",0]
["Scrap","551","MB-CU-0114","Detroit Brass pipe scrap dealer buying price delivered to yard cents/lb","US Cents","pound","twice monthly",0]
["Scrap","552","MB-CU-0115","Chicago Brass pipe scrap dealer buying price delivered to yard cents/lb","US Cents","pound","twice monthly",0]
["Scrap","553","MB-CU-0116","St Louis Brass pipe scrap dealer buying price delivered to yard cents/lb","US Cents","pound","twice monthly",0]
["Scrap","554","MB-CU-0117","San Francisco Brass pipe scrap dealer buying price delivered to yard cents/lb","US Cents","pound","twice monthly",0]
["Scrap","555","MB-CU-0118","Los Angeles Brass pipe scrap dealer buying price delivered to yard cents/lb","US Cents","pound","twice monthly",0]
["Scrap","556","MB-CU-0119","Montreal Yellow brass solids scrap dealer buying price delivered to yard Canadian cents/lb","CA Cents","pound","twice monthly",0]
["Scrap","557","MB-CU-0120","Toronto Yellow brass solids scrap dealer buying price delivered to yard Canadian cents/lb","CA Cents","pound","twice monthly",0]
["Scrap","558","MB-CU-0121","Buffalo Yellow brass solids scrap dealer buying price delivered to yard cents/lb","US Cents","pound","twice monthly",0]
["Scrap","559","MB-CU-0122","Boston Yellow brass solids scrap dealer buying price delivered to yard cents/lb","US Cents","pound","twice monthly",0]
["Scrap","560","MB-CU-0123","New York Yellow brass solids scrap dealer buying price delivered to yard cents/lb","US Cents","pound","twice monthly",0]
["Scrap","561","MB-CU-0124","Philadelphia Yellow brass solids scrap dealer buying price delivered to yard cents/lb","US Cents","pound","twice monthly",0]
["Scrap","562","MB-CU-0125","Atlanta Yellow brass solids dealer buying price delivered to yard cents/lb","US Cents","pound","twice monthly",0]
["Scrap","563","MB-CU-0126","Houston Yellow brass solids scrap  dealer buying price delivered to yard cents/lb","US Cents","pound","twice monthly",0]
["Scrap","564","MB-CU-0127","Pittsburgh Yellow brass solids scrap  dealer buying price delivered to yard cents/lb","US Cents","pound","twice monthly",0]
["Scrap","565","MB-CU-0128","Cleveland Yellow brass solids scrap  dealer buying price delivered to yard cents/lb","US Cents","pound","twice monthly",0]
["Scrap","566","MB-CU-0129","Cincinnati Yellow brass solids scrap  dealer buying price delivered to yard cents/lb","US Cents","pound","twice monthly",0]
["Scrap","567","MB-CU-0130","Detroit Yellow brass solids scrap  dealer buying price delivered to yard cents/lb","US Cents","pound","twice monthly",0]
["Scrap","568","MB-CU-0131","Chicago Yellow brass solids scrap  dealer buying price delivered to yard cents/lb","US Cents","pound","twice monthly",0]
["Scrap","569","MB-CU-0132","St Louis Yellow brass solids scrap  dealer buying price delivered to yard cents/lb","US Cents","pound","twice monthly",0]
["Scrap","570","MB-CU-0133","San Francisco Yellow brass solids dealer buying price delivered to yard cents/lb","US Cents","pound","twice monthly",0]
["Scrap","571","MB-CU-0134","Los Angeles Yellow brass solids scrap  dealer buying price delivered to yard cents/lb","US Cents","pound","twice monthly",0]
["Scrap","572","MB-CU-0135","Montreal Mixed Yellow brass turnings, borings scrap dealer buying price delivered to yard cents/lb","CA Cents","pound","twice monthly",0]
["Scrap","573","MB-CU-0136","Toronto Mixed Yellow brass turnings, borings scrap dealer buying price delivered to yard cents/lb","CA Cents","pound","twice monthly",0]
["Scrap","575","MB-CU-0138","Boston Mixed Yellow brass turnings, borings scrap dealer buying price delivered to yard cents/lb","US Cents","pound","twice monthly",0]
["Scrap","576","MB-CU-0139","New York Mixed Yellow brass turnings, borings scrap dealer buying price delivered to yard cents/lb","US Cents","pound","twice monthly",0]
["Scrap","577","MB-CU-0140","Philadelphia Mixed Yellow brass turnings, borings scrap dealer buying price delivered to yard cents/lb","US Cents","pound","twice monthly",0]
["Scrap","578","MB-CU-0141","Atlanta Mixed Yellow brass turnings, borings scrap dealer buying price delivered to yard cents/lb","US Cents","pound","twice monthly",0]
["Scrap","579","MB-CU-0142","Houston Mixed Yellow brass turnings, borings scrap dealer buying price delivered to yard cents/lb","US Cents","pound","twice monthly",0]
["Scrap","580","MB-CU-0143","Pittsburgh Mixed Yellow brass turnings, borings scrap dealer buying price delivered to yard cents/lb","US Cents","pound","twice monthly",0]
["Scrap","581","MB-CU-0144","Cleveland Mixed Yellow brass turnings, borings scrap dealer buying price delivered to yard cents/lb","US Cents","pound","twice monthly",0]
["Scrap","582","MB-CU-0145","Cincinnati Mixed Yellow brass turnings, borings scrap dealer buying price delivered to yard cents/lb","US Cents","pound","twice monthly",0]
["Scrap","583","MB-CU-0146","Detroit Mixed Yellow brass turnings, borings scrap dealer buying price delivered to yard cents/lb","US Cents","pound","twice monthly",0]
["Scrap","584","MB-CU-0147","Chicago Mixed Yellow brass turnings, borings scrap dealer buying price delivered to yard cents/lb","US Cents","pound","twice monthly",0]
["Scrap","585","MB-CU-0148","St Louis Mixed Yellow brass turnings, borings scrap dealer buying price delivered to yard cents/lb","US Cents","pound","twice monthly",0]
["Scrap","586","MB-CU-0149","San Francisco Mixed yellow brass turnings, borings dealer buying price delivered to yard cents/lb","US Cents","pound","twice monthly",0]
["Scrap","587","MB-CU-0150","Los Angeles Mixed wellow brass turnings, borings scrap dealer buying price delivered to yard cents/lb","US Cents","pound","twice monthly",0]
["Scrap","588","MB-CU-0151","Montreal Yellow brass rod ends scrap dealer buying price delivered to yard cents/lb","CA Cents","pound","twice monthly",0]
["Scrap","590","MB-CU-0153","Boston Yellow brass rod ends scrap dealer buying price delivered to yard cents/lb","US Cents","pound","twice monthly",0]
["Scrap","591","MB-CU-0154","New York Yellow brass rod ends scrap dealer buying price delivered to yard cents/lb","US Cents","pound","twice monthly",0]
["Scrap","592","MB-CU-0155","Philadelphia Yellow brass rod ends scrap dealer buying price delivered to yard cents/lb","US Cents","pound","twice monthly",0]
["Scrap","593","MB-CU-0156","Atlanta Yellow brass rod ends scrap dealer buying price delivered to yard cents/lb","US Cents","pound","twice monthly",0]
["Scrap","594","MB-CU-0157","Houston Yellow brass rod ends scrap dealer buying price delivered to yard cents/lb","US Cents","pound","twice monthly",0]
["Scrap","595","MB-CU-0158","Pittsburgh Yellow brass rod ends scrap dealer buying price delivered to yard cents/lb","US Cents","pound","twice monthly",0]
["Scrap","596","MB-CU-0159","Cleveland Yellow brass rod ends scrap dealer buying price delivered to yard cents/lb","US Cents","pound","twice monthly",0]
["Scrap","597","MB-CU-0160","Cincinnati Yellow brass rod ends scrap dealer buying price delivered to yard cents/lb","US Cents","pound","twice monthly",0]
["Scrap","598","MB-CU-0161","Detroit Yellow brass rod ends scrap dealer buying price delivered to yard cents/lb","US Cents","pound","twice monthly",0]
["Scrap","599","MB-CU-0162","Chicago Yellow brass rod ends scrap dealer buying price delivered to yard cents/lb","US Cents","pound","twice monthly",0]
["Scrap","600","MB-CU-0163","St Louis Yellow brass rod ends scrap dealer buying price delivered to yard cents/lb","US Cents","pound","twice monthly",0]
["Scrap","601","MB-CU-0164","San Francisco Yellow brass rod ends scrap dealer buying price delivered to yard cents/lb","US Cents","pound","twice monthly",0]
["Scrap","602","MB-CU-0165","Los Angeles Yellow brass rod ends scrap dealer buying price delivered to yard cents/lb","US Cents","pound","twice monthly",0]
["Scrap","603","MB-CU-0166","Montreal Yellow brass rod turnings scrap dealer buying price delivered to yard cents/lb","US Cents","pound","twice monthly",0]
["Scrap","604","MB-CU-0167","Buffalo Yellow brass rod turnings scrap dealer buying price delivered to yard cents/lb","US Cents","pound","twice monthly",0]
["Scrap","605","MB-CU-0168","Boston Yellow brass rod turnings scrap dealer buying price delivered to yard cents/lb","US Cents","pound","twice monthly",0]
["Scrap","606","MB-CU-0169","New York Yellow brass rod turnings scrap dealer buying price delivered to yard cents/lb","US Cents","pound","twice monthly",0]
["Scrap","607","MB-CU-0170","Philadelphia Yellow brass rod turnings scrap dealer buying price delivered to yard cents/lb","US Cents","pound","twice monthly",0]
["Scrap","608","MB-CU-0171","Atlanta Yellow brass rod turnings scrap dealer buying price delivered to yard cents/lb","US Cents","pound","twice monthly",0]
["Scrap","609","MB-CU-0172","Houston Yellow brass rod turnings scrap dealer buying price delivered to yard cents/lb","US Cents","pound","twice monthly",0]
["Scrap","610","MB-CU-0173","Pittsburgh Yellow brass rod turnings scrap dealer buying price delivered to yard cents/lb","US Cents","pound","twice monthly",0]
["Scrap","611","MB-CU-0174","Cleveland Yellow brass rod turnings scrap dealer buying price delivered to yard cents/lb","US Cents","pound","twice monthly",0]
["Scrap","612","MB-CU-0175","Cincinnati Yellow brass rod turnings scrap dealer buying price delivered to yard cents/lb","US Cents","pound","twice monthly",0]
["Scrap","613","MB-CU-0176","Detroit Yellow brass rod turnings scrap dealer buying price delivered to yard cents/lb","US Cents","pound","twice monthly",0]
["Scrap","614","MB-CU-0177","Chicago Yellow brass rod turnings scrap dealer buying price delivered to yard cents/lb","US Cents","pound","twice monthly",0]
["Scrap","615","MB-CU-0178","St Louis Yellow brass rod turnings scrap dealer buying price delivered to yard cents/lb","US Cents","pound","twice monthly",0]
["Scrap","616","MB-CU-0179","San Francisco Yellow brass rod turnings scrap dealer buying price delivered to yard cents/lb","US Cents","pound","twice monthly",0]
["Scrap","617","MB-CU-0180","Los Angeles Yellow brass rod turnings scrap dealer buying price delivered to yard cents/lb","US Cents","pound","twice monthly",0]
["Scrap","618","MB-CU-0181","Montreal 70-30 Brass Clips scrap scrap dealer buying price delivered to yard Canadian cents/lb"," CA Cents","pound","twice monthly",0]
["Scrap","620","MB-CU-0183","Boston 70-30 Brass Clips scrap dealer buying price delivered to yard cents/lb","US Cents","pound","twice monthly",0]
["Scrap","621","MB-CU-0184","New York 70-30 Brass Clips scrap dealer buying price delivered to yard cents/lb","US Cents","pound","twice monthly",0]
["Scrap","622","MB-CU-0185","Philadelphia 70-30 Brass Clips scrap dealer buying price delivered to yard cents/lb","US Cents","pound","twice monthly",0]
["Scrap","623","MB-CU-0186","Atlanta 70-30 Brass Clips scrap dealer buying price delivered to yard cents/lb","US Cents","pound","twice monthly",0]
["Scrap","624","MB-CU-0187","Houston 70-30 Brass Clips scrap dealer buying price delivered to yard cents/lb","US Cents","pound","twice monthly",0]
["Scrap","625","MB-CU-0188","Pittsburgh 70-30 Brass Clips scrap dealer buying price delivered to yard cents/lb","US Cents","pound","twice monthly",0]
["Scrap","626","MB-CU-0189","Cleveland 70-30 Brass Clips scrap dealer buying price delivered to yard cents/lb","US Cents","pound","twice monthly",0]
["Scrap","627","MB-CU-0190","Cincinnati 70-30 Brass Clips scrap dealer buying price delivered to yard cents/lb","US Cents","pound","twice monthly",0]
["Scrap","628","MB-CU-0191","Detroit 70-30 Brass Clips scrap dealer buying price delivered to yard cents/lb","US Cents","pound","twice monthly",0]
["Scrap","629","MB-CU-0192","Chicago 70-30 Brass Clips scrap dealer buying price delivered to yard cents/lb","US Cents","pound","twice monthly",0]
["Scrap","630","MB-CU-0193","St Louis 70-30 Brass Clips scrap dealer buying price delivered to yard cents/lb","US Cents","pound","twice monthly",0]
["Scrap","631","MB-CU-0194","San Francisco 70-30 Brass Clips scrap dealer buying price delivered to yard cents/lb","US Cents","pound","twice monthly",0]
["Scrap","632","MB-CU-0195","Los Angeles 70-30 Brass Clips scrap dealer buying price delivered to yard cents/lb","US Cents","pound","twice monthly",0]
["Scrap","633","MB-CU-0196","Montreal Auto radiators (unsweated) scrap dealer buying price delivered to yard Canadian cents/lb","CA Cents","pound","twice monthly",0]
["Scrap","634","MB-CU-0197","Toronto Auto radiators (unsweated) scrap dealer buying price delivered to yard Canadian cents/lb","CA Cents","pound","twice monthly",0]
["Scrap","636","MB-CU-0199","Boston Auto radiators (unsweated) scrap dealer buying price delivered to yard cents/lb","US Cents","pound","twice monthly",0]
["Scrap","637","MB-CU-0200","New York Auto radiators (unsweated) scrap dealer buying price delivered to yard cents/lb","US Cents","pound","twice monthly",0]
["Scrap","638","MB-CU-0201","Philadelphia Auto radiators (unsweated) scrap dealer buying price delivered to yard cents/lb","US Cents","pound","twice monthly",0]
["Scrap","639","MB-CU-0202","Atlanta Auto radiators (unsweated) scrap dealer buying price delivered to yard cents/lb","US Cents","pound","twice monthly",0]
["Scrap","640","MB-CU-0203","Houston Auto radiators (unsweated) scrap dealer buying price delivered to yard cents/lb","US Cents","pound","twice monthly",0]
["Scrap","641","MB-CU-0204","Pittsburgh Auto radiators (unsweated) scrap dealer buying price delivered to yard cents/lb","US Cents","pound","twice monthly",0]
["Scrap","642","MB-CU-0205","Cleveland Auto radiators (unsweated) scrap dealer buying price delivered to yard cents/lb","US Cents","pound","twice monthly",0]
["Scrap","643","MB-CU-0206","Cincinnati Auto radiators (unsweated) scrap dealer buying price delivered to yard cents/lb","US Cents","pound","twice monthly",0]
["Scrap","644","MB-CU-0207","Detroit Auto radiators (unsweated) scrap dealer buying price delivered to yard cents/lb","US Cents","pound","twice monthly",0]
["Scrap","645","MB-CU-0208","Chicago Auto radiators (unsweated) scrap dealer buying price delivered to yard cents/lb","US Cents","pound","twice monthly",0]
["Scrap","646","MB-CU-0209","St Louis Auto radiators (unsweated) scrap dealer buying price delivered to yard cents/lb","US Cents","pound","twice monthly",0]
["Scrap","647","MB-CU-0210","San Francisco Auto radiators (unsweated) scrap dealer buying price delivered to yard cents/lb","US Cents","pound","twice monthly",0]
["Scrap","648","MB-CU-0211","Los Angeles Auto radiators (unsweated) scrap dealer buying price delivered to yard cents/lb","US Cents","pound","twice monthly",0]
["Scrap","649","MB-CU-0212","Montreal High-grade bronze gears scrap dealer buying price delivered to yard cents/lb","CA Cents","pound","twice monthly",0]
["Scrap","650","MB-CU-0213","Toronto High-grade bronze gears scrap dealer buying price delivered to yard cents/lb","CA Cents","pound","twice monthly",0]
["Scrap","652","MB-CU-0215","Boston High-grade bronze gears scrap dealer buying price delivered to yard cents/lb","US Cents","pound","twice monthly",0]
["Scrap","653","MB-CU-0216","New York High-grade bronze gears scrap dealer buying price delivered to yard cents/lb","US Cents","pound","twice monthly",0]
["Scrap","654","MB-CU-0217","Philadelphia High-grade bronze gears scrap dealer buying price delivered to yard cents/lb","US Cents","pound","twice monthly",0]
["Scrap","655","MB-CU-0218","Atlanta High-grade bronze gears scrap dealer buying price delivered to yard cents/lb","US Cents","pound","twice monthly",0]
["Scrap","656","MB-CU-0219","Houston High-grade bronze gears scrap dealer buying price delivered to yard cents/lb","US Cents","pound","twice monthly",0]
["Scrap","657","MB-CU-0220","Pittsburgh High-grade bronze gears scrap dealer buying price delivered to yard cents/lb","US Cents","pound","twice monthly",0]
["Scrap","658","MB-CU-0221","Cleveland High-grade bronze gears scrap dealer buying price delivered to yard cents/lb","US Cents","pound","twice monthly",0]
["Scrap","659","MB-CU-0222","Cincinnati High-grade bronze gears scrap dealer buying price delivered to yard cents/lb","US Cents","pound","twice monthly",0]
["Scrap","660","MB-CU-0223","Detroit High-grade bronze gears scrap dealer buying price delivered to yard cents/lb","US Cents","pound","twice monthly",0]
["Scrap","661","MB-CU-0224","Chicago High-grade bronze gears scrap dealer buying price delivered to yard cents/lb","US Cents","pound","twice monthly",0]
["Scrap","662","MB-CU-0225","San Francisco High-grade bronze gears scrap dealer buying price delivered to yard cents/lb","US Cents","pound","twice monthly",0]
["Scrap","663","MB-CU-0226","Los Angeles High-grade bronze gears scrap dealer buying price delivered to yard cents/lb","US Cents","pound","twice monthly",0]
["Scrap","664","MB-CU-0227","Montreal High-grade low lead bronze scrap dealer buying price delivered to yard cents/lb","CA Cents","pound","twice monthly",0]
["Scrap","665","MB-CU-0228","Atlanta High-grade low lead bronze scrap dealer buying price delivered to yard cents/lb","US Cents","pound","twice monthly",0]
["Scrap","666","MB-CU-0229","Houston High-grade low lead bronze scrap dealer buying price delivered to yard cents/lb","US Cents","pound","twice monthly",0]
["Scrap","667","MB-CU-0230","Pittsburgh High-grade low lead bronze scrap dealer buying price delivered to yard cents/lb","US Cents","pound","twice monthly",0]
["Scrap","668","MB-CU-0231","Cleveland High-grade low lead bronze scrap dealer buying price delivered to yard cents/lb","US Cents","pound","twice monthly",0]
["Scrap","669","MB-CU-0232","Cincinnati High-grade low lead bronze scrap dealer buying price delivered to yard cents/lb","US Cents","pound","twice monthly",0]
["Scrap","670","MB-CU-0233","Detroit High-grade low lead bronze scrap dealer buying price delivered to yard cents/lb","US Cents","pound","twice monthly",0]
["Scrap","671","MB-CU-0234","Chicago High-grade low lead bronze scrap dealer buying price delivered to yard cents/lb","US Cents","pound","twice monthly",0]
["Scrap","672","MB-CU-0235","St Louis High-grade low lead bronze scrap dealer buying price delivered to yard cents/lb","US Cents","pound","twice monthly",0]
["Scrap","673","MB-CU-0236","San Francisco High-grade low lead bronze scrap dealer buying price delivered to yard cents/lb","US Cents","pound","twice monthly",0]
["Scrap","674","MB-CU-0237","Los Angeles High-grade low lead bronze scrap dealer buying price delivered to yard cents/lb","US Cents","pound","twice monthly",0]
["Scrap","675","MB-CU-0238","Montreal Manganese bronze solids scrap dealer buying price delivered to yard Canadian cents/lb","CA Cents","pound","twice monthly",0]
["Scrap","676","MB-CU-0239","Toronto Manganese bronze solids scrap dealer buying price delivered to yard Canadian cents/lb","CA Cents","pound","twice monthly",0]
["Scrap","678","MB-CU-0241","Boston Manganese bronze solids scrap dealer buying price delivered to yard cents/lb","US Cents","pound","twice monthly",0]
["Scrap","679","MB-CU-0242","New York Manganese bronze solids scrap dealer buying price delivered to yard cents/lb","US Cents","pound","twice monthly",0]
["Scrap","680","MB-CU-0243","Philadelphia Manganese bronze solids scrap dealer buying price delivered to yard cents/lb","US Cents","pound","twice monthly",0]
["Scrap","681","MB-CU-0244","Atlanta Manganese bronze solids scrap dealer buying price delivered to yard cents/lb","US Cents","pound","twice monthly",0]
["Scrap","682","MB-CU-0245","Houston Manganese bronze solids scrap dealer buying price delivered to yard cents/lb","US Cents","pound","twice monthly",0]
["Scrap","683","MB-CU-0246","Pittsburgh Manganese bronze solids scrap dealer buying price delivered to yard cents/lb","US Cents","pound","twice monthly",0]
["Scrap","684","MB-CU-0247","Cleveland Manganese bronze solids scrap dealer buying price delivered to yard cents/lb","US Cents","pound","twice monthly",0]
["Scrap","685","MB-CU-0248","Cincinnati Manganese bronze solids scrap dealer buying price delivered to yard cents/lb","US Cents","pound","twice monthly",0]
["Scrap","686","MB-CU-0249","Detroit Manganese bronze solids scrap dealer buying price delivered to yard cents/lb","US Cents","pound","twice monthly",0]
["Scrap","687","MB-CU-0250","Chicago Manganese bronze solids scrap dealer buying price delivered to yard cents/lb","US Cents","pound","twice monthly",0]
["Scrap","688","MB-CU-0251","St Louis Manganese bronze solids scrap dealer buying price delivered to yard cents/lb","US Cents","pound","twice monthly",0]
["Scrap","689","MB-CU-0252","San Francisco Manganese bronze solids scrap dealer buying price delivered to yard cents/lb","US Cents","pound","twice monthly",0]
["Scrap","690","MB-CU-0253","Los Angeles Manganese bronze solids scrap dealer buying price delivered to yard cents/lb","US Cents","pound","twice monthly",0]
["Scrap","691","MB-CU-0254","Montreal Misc. nickel-\"silver\" solids scrap scrap dealer buying price delivered to yard cents/lb","CA Cents","pound","twice monthly",0]
["Scrap","693","MB-CU-0256","Boston Misc. nickel-\"silver\" solids scrap scrap dealer buying price delivered to yard cents/lb","US Cents","pound","twice monthly",0]
["Scrap","694","MB-CU-0257","New York Misc. nickel-\"silver\" solids scrap dealer buying price delivered to yard cents/lb","US Cents","pound","twice monthly",0]
["Scrap","695","MB-CU-0258","Philadelphia Misc. nickel-\"silver\" solids scrap dealer buying price delivered to yard cents/lb","US Cents","pound","twice monthly",0]
["Scrap","696","MB-CU-0259","Atlanta Misc. nickel-\"silver\" solids scrap dealer buying price delivered to yard cents/lb","US Cents","pound","twice monthly",0]
["Scrap","697","MB-CU-0260","Houston Misc. nickel-\"silver\" solids scrap dealer buying price delivered to yard cents/lb","US Cents","pound","twice monthly",0]
["Scrap","698","MB-CU-0261","Pittsburgh Misc. nickel-\"silver\" solids scrap dealer buying price delivered to yard cents/lb","US Cents","pound","twice monthly",0]
["Scrap","699","MB-CU-0262","Cleveland Misc. nickel-\"silver\" solids scrap dealer buying price delivered to yard cents/lb","US Cents","pound","twice monthly",0]
["Scrap","7","MB-AL-0006","Aluminium Scrap, Baled Old Rolled, United Kingdom, delivered consumer works, £ per tonne","GBP","tonne","Weekly",0]
["Scrap","700","MB-CU-0263","Cincinnati Misc. nickel-\"silver\" solids scrap dealer buying price delivered to yard cents/lb","US Cents","pound","twice monthly",0]
["Scrap","701","MB-CU-0264","Detroit Misc. nickel-\"silver\" solids scrap dealer buying price delivered to yard cents/lb","US Cents","pound","twice monthly",0]
["Scrap","702","MB-CU-0265","Chicago Misc. nickel-\"silver\" solids scrap dealer buying price delivered to yard cents/lb","US Cents","pound","twice monthly",0]
["Scrap","703","MB-CU-0266","St Louis Misc. nickel-\"silver\" solids scrap dealer buying price delivered to yard cents/lb","US Cents","pound","twice monthly",0]
["Scrap","704","MB-CU-0267","San Francisco Misc. nickel-\"silver\" solids scrap dealer buying price delivered to yard cents/lb","US Cents","pound","twice monthly",0]
["Scrap","705","MB-CU-0268","Los Angeles Misc. nickel-\"silver\" solids scrap dealer buying price delivered to yard cents/lb","US Cents","pound","twice monthly",0]
["Scrap","706","MB-CU-0269","Montreal Manganese bronze turnings scrap dealer buying price delivered to yard cents/lb","CA Cents","pound","twice monthly",0]
["Scrap","707","MB-CU-0270","Toronto Manganese bronze turnings scrap dealer buying price delivered to yard cents/lb","CA Cents","pound","twice monthly",0]
["Scrap","709","MB-CU-0272","Boston Manganese bronze turnings scrap dealer buying price delivered to yard cents/lb","US Cents","pound","twice monthly",0]
["Scrap","710","MB-CU-0273","New York Manganese bronze turnings scrap dealer buying price delivered to yard cents/lb","US Cents","pound","twice monthly",0]
["Scrap","711","MB-CU-0274","Philadelphia Manganese bronze turnings scrap dealer buying price delivered to yard cents/lb","US Cents","pound","twice monthly",0]
["Scrap","712","MB-CU-0275","Atlanta Manganese bronze turnings scrap dealer buying price delivered to yard cents/lb","US Cents","pound","twice monthly",0]
["Scrap","713","MB-CU-0276","Houston Manganese bronze turnings scrap dealer buying price delivered to yard cents/lb","US Cents","pound","twice monthly",0]
["Scrap","714","MB-CU-0277","Pittsburgh Manganese bronze turnings scrap dealer buying price delivered to yard cents/lb","US Cents","pound","twice monthly",0]
["Scrap","715","MB-CU-0278","Cleveland Manganese bronze turnings scrap dealer buying price delivered to yard cents/lb","US Cents","pound","twice monthly",0]
["Scrap","716","MB-CU-0279","Cincinnati Manganese bronze turnings scrap dealer buying price delivered to yard cents/lb","US Cents","pound","twice monthly",0]
["Scrap","717","MB-CU-0280","Detroit Manganese bronze turnings scrap dealer buying price delivered to yard cents/lb","US Cents","pound","twice monthly",0]
["Scrap","718","MB-CU-0281","Chicago Manganese bronze turnings scrap dealer buying price delivered to yard cents/lb","US Cents","pound","twice monthly",0]
["Scrap","719","MB-CU-0282","St Louis Manganese bronze turnings scrap dealer buying price delivered to yard cents/lb","US Cents","pound","twice monthly",0]
["Scrap","720","MB-CU-0283","San Francisco Manganese bronze turnings scrap dealer buying price delivered to yard cents/lb","US Cents","pound","twice monthly",0]
["Scrap","721","MB-CU-0284","Los Angeles Manganese bronze turnings scrap dealer buying price delivered to yard cents/lb","US Cents","pound","twice monthly",0]
["Scrap","722","MB-PB-0009","Montreal Heavy soft lead scrap dealer buying price delivered to yard cents/lb","CA Cents","pound","twice monthly",0]
["Scrap","723","MB-PB-0010","Toronto Heavy soft lead scrap dealer buying price delivered to yard cents/lb","CA Cents","pound","twice monthly",0]
["Scrap","725","MB-PB-0012","Boston Heavy soft lead scrap dealer buying price delivered to yard cents/lb","US Cents","pound","twice monthly",0]
["Scrap","726","MB-PB-0013","New York Heavy soft lead scrap dealer buying price delivered to yard cents/lb","US Cents","pound","twice monthly",0]
["Scrap","727","MB-PB-0014","Philly Heavy soft lead scrap dealer buying price delivered to yard cents/lb","US Cents","pound","twice monthly",0]
["Scrap","728","MB-PB-0015","Atlanta Heavy soft lead scrap dealer buying price delivered to yard cents/lb","US Cents","pound","twice monthly",0]
["Scrap","729","MB-PB-0016","Houston Heavy soft lead scrap dealer buying price delivered to yard cents/lb","US Cents","pound","twice monthly",0]
["Scrap","730","MB-PB-0017","Cleveland Heavy soft lead scrap dealer buying price delivered to yard cents/lb","US Cents","pound","twice monthly",0]
["Scrap","731","MB-PB-0018","Detroit Heavy soft lead scrap dealer buying price delivered to yard cents/lb","US Cents","pound","twice monthly",0]
["Scrap","732","MB-PB-0019","Chicago Heavy soft lead scrap dealer buying price delivered to yard cents/lb","US Cents","pound","twice monthly",0]
["Scrap","733","MB-PB-0020","St Louis Heavy soft lead scrap dealer buying price delivered to yard cents/lb","US Cents","pound","twice monthly",0]
["Scrap","734","MB-PB-0021","SF-Portland Heavy soft lead scrap dealer buying price delivered to yard cents/lb","US Cents","pound","twice monthly",0]
["Scrap","736","MB-PB-0023","Montreal Mixed hard lead scrap dealer buying price delivered to yard cents/lb","CA Cents","pound","twice monthly",0]
["Scrap","738","MB-PB-0025","Atlanta Mixed hard lead scrap dealer buying price delivered to yard cents/lb","US Cents","pound","twice monthly",0]
["Scrap","739","MB-PB-0026","Houston Mixed hard lead scrap dealer buying price delivered to yard cents/lb","US Cents","pound","twice monthly",0]
["Scrap","740","MB-PB-0027","Cleveland Mixed hard lead scrap dealer buying price delivered to yard cents/lb","US Cents","pound","twice monthly",0]
["Scrap","741","MB-PB-0028","Detroit Mixed hard lead scrap dealer buying price delivered to yard cents/lb","US Cents","pound","twice monthly",0]
["Scrap","742","MB-PB-0029","Chicago Mixed hard lead scrap dealer buying price delivered to yard cents/lb","US Cents","pound","twice monthly",0]
["Scrap","743","MB-PB-0030","St Louis Mixed hard lead scrap dealer buying price delivered to yard cents/lb","US Cents","pound","twice monthly",0]
["Scrap","744","MB-PB-0031","SF-Portland Mixed hard lead scrap dealer buying price delivered to yard cents/lb","US Cents","pound","twice monthly",0]
["Scrap","746","MB-PB-0033","Montreal Undrained Whole old batteries scrap dealer buying price delivered to yard cents/lb","US Cents","pound","twice monthly",0]
["Scrap","748","MB-PB-0035","New York Undrained Whole old batteries scrap dealer buying price delivered to yard cents/lb","US Cents","pound","twice monthly",0]
["Scrap","750","MB-PB-0037","Pittsburgh Undrained Whole old batteries scrap dealer buying price delivered to yard cents/lb","US Cents","pound","twice monthly",0]
["Scrap","751","MB-PB-0038","Cleveland Undrained Whole old batteries scrap dealer buying price delivered to yard cents/lb","US Cents","pound","twice monthly",0]
["Scrap","752","MB-PB-0039","SF-Portland Undrained Whole old batteries scrap dealer buying price delivered to yard cents/lb","US Cents","pound","twice monthly",0]
["Scrap","754","MB-PB-0041","Montreal Wheel weights scrap dealer buying price delivered to yard cents/lb","CA Cents","pound","twice monthly",0]
["Scrap","756","MB-PB-0043","Boston Wheel weights scrap dealer buying price delivered to yard cents/lb","US Cents","pound","twice monthly",0]
["Scrap","757","MB-PB-0044","New York Wheel weights scrap dealer buying price delivered to yard cents/lb","US Cents","pound","twice monthly",0]
["Scrap","758","MB-PB-0045","Philly Wheel weights scrap dealer buying price delivered to yard cents/lb","US Cents","pound","twice monthly",0]
["Scrap","759","MB-PB-0046","Atlanta Wheel weights scrap dealer buying price delivered to yard cents/lb","US Cents","pound","twice monthly",0]
["Scrap","760","MB-PB-0047","Houston Wheel weights scrap dealer buying price delivered to yard cents/lb","US Cents","pound","twice monthly",0]
["Scrap","761","MB-PB-0048","Pittsburgh Wheel weights scrap dealer buying price delivered to yard cents/lb","US Cents","pound","twice monthly",0]
["Scrap","762","MB-PB-0049","Cleveland Wheel weights scrap dealer buying price delivered to yard cents/lb","US Cents","pound","twice monthly",0]
["Scrap","763","MB-PB-0050","Detroit Wheel weights scrap dealer buying price delivered to yard cents/lb","US Cents","pound","twice monthly",0]
["Scrap","764","MB-PB-0051","Chicago Wheel weights scrap dealer buying price delivered to yard cents/lb","US Cents","pound","twice monthly",0]
["Scrap","765","MB-PB-0052","SF-Portland Wheel weights scrap dealer buying price delivered to yard cents/lb","US Cents","pound","twice monthly",0]
["Scrap","767","MB-AL-0053","Montreal Segregated low-copper clips scrap dealer buying price delivered to yard cents/lb","CA Cents","pound","twice monthly",0]
["Scrap","768","MB-AL-0054","Toronto Segregated low-copper clips scrap dealer buying price delivered to yard cents/lb","CA Cents","pound","twice monthly",0]
["Scrap","770","MB-AL-0056","Boston Segregated low-copper clips scrap dealer buying price delivered to yard cents/lb","US Cents","pound","twice monthly",0]
["Scrap","771","MB-AL-0057","New York Segregated low-copper clips scrap dealer buying price cents per clips pound delivered to yard","US Cents","pound","twice monthly",0]
["Scrap","772","MB-AL-0058","Philadelphia Segregated low-copper clips scrap dealer buying price delivered to yard cents/lb","US Cents","pound","twice monthly",0]
["Scrap","773","MB-AL-0059","Atlanta Segregated low-copper clips scrap dealer buying price delivered to yard cents/lb","US Cents","pound","twice monthly",0]
["Scrap","774","MB-AL-0060","Houston Segregated low-copper clips scrap dealer buying price delivered to yard cents/lb","US Cents","pound","twice monthly",0]
["Scrap","775","MB-AL-0061","Pittsburgh Segregated low-copper clips scrap dealer buying price delivered to yard cents/lb","US Cents","pound","twice monthly",0]
["Scrap","776","MB-AL-0062","Cleveland Segregated low-copper clips scrap dealer buying price delivered to yard cents/lb","US Cents","pound","twice monthly",0]
["Scrap","777","MB-AL-0063","Cincinnati Segregated low-copper clips scrap dealer buying price delivered to yard cents/lb","US Cents","pound","twice monthly",0]
["Scrap","778","MB-AL-0064","Detroit Segregated low-copper clips scrap dealer buying price delivered to yard cents/lb","US Cents","pound","twice monthly",0]
["Scrap","779","MB-AL-0065","Chicago Segregated low-copper clips scrap dealer buying price delivered to yard cents/lb","US Cents","pound","twice monthly",0]
["Scrap","780","MB-AL-0066","St Louis Segregated low-copper clips scrap dealer buying price cents per clips pound delivered to yard","US Cents","pound","twice monthly",0]
["Scrap","781","MB-AL-0067","San Francisco Segregated low-copper clips scrap dealer buying price delivered to yard cents/lb","US Cents","pound","twice monthly",0]
["Scrap","782","MB-AL-0068","Los Angeles Segregated low-copper clips scrap dealer buying price cents per clips pound delivered to yard","US Cents","pound","twice monthly",0]
["Scrap","783","MB-AL-0069","Montreal Mixed low-copper clips scrap dealer buying price delivered to yard cents/lb","CA Cents","pound","twice monthly",0]
["Scrap","784","MB-AL-0070","Toronto Mixed low-copper clips scrap dealer buying price delivered to yard cents/lb","CA Cents","pound","twice monthly",0]
["Scrap","786","MB-AL-0072","Boston Mixed low-copper clips scrap dealer buying price delivered to yard cents/lb","US Cents","pound","twice monthly",0]
["Scrap","787","MB-AL-0073","New York Mixed low-copper clips scrap dealer buying price delivered to yard cents/lb","US Cents","pound","twice monthly",0]
["Scrap","788","MB-AL-0074","Philadelphia Mixed low-copper clips scrap dealer buying price delivered to yard cents/lb","US Cents","pound","twice monthly",0]
["Scrap","789","MB-AL-0075","Atlanta Mixed low-copper clips scrap dealer buying price delivered to yard cents/lb","US Cents","pound","twice monthly",0]
["Scrap","790","MB-AL-0076","Houston Mixed low-copper clips scrap dealer buying price delivered to yard cents/lb","US Cents","pound","twice monthly",0]
["Scrap","791","MB-AL-0077","Pittsburgh Mixed low-copper clips scrap dealer buying price delivered to yard cents/lb","US Cents","pound","twice monthly",0]
["Scrap","792","MB-AL-0078","Cleveland Mixed low-copper clips scrap dealer buying price delivered to yard cents/lb","US Cents","pound","twice monthly",0]
["Scrap","793","MB-AL-0079","Cincinnati Mixed low-copper clips scrap dealer buying price delivered to yard cents/lb","US Cents","pound","twice monthly",0]
["Scrap","794","MB-AL-0080","Detroit Mixed low-copper clips scrap dealer buying price delivered to yard cents/lb","US Cents","pound","twice monthly",0]
["Scrap","795","MB-AL-0081","Chicago Mixed low-copper clips scrap dealer buying price delivered to yard cents/lb","US Cents","pound","twice monthly",0]
["Scrap","796","MB-AL-0082","St Louis Mixed low-copper clips scrap dealer buying price delivered to yard cents/lb","US Cents","pound","twice monthly",0]
["Scrap","797","MB-AL-0083","San Francisco Mixed low-copper clips scrap dealer buying price delivered to yard cents/lb","US Cents","pound","twice monthly",0]
["Scrap","798","MB-AL-0084","Los Angeles Mixed low-copper clips scrap dealer buying price delivered to yard cents/lb","US Cents","pound","twice monthly",0]
["Scrap","799","MB-AL-0085","Montreal Mixed Clips scrap dealer buying price delivered to yard cents/lb","CA Cents","pound","twice monthly",0]
["Scrap","8","MB-AL-0007","Aluminium Scrap, Cast Wheels, United Kingdom, del consumer works, £ per tonne","GBP","tonne","Weekly",0]
["Scrap","800","MB-AL-0086","Toronto Mixed Clips scrap dealer buying price delivered to yard cents/lb","CA Cents","pound","twice monthly",0]
["Scrap","802","MB-AL-0088","Boston Mixed Clips scrap dealer buying price delivered to yard cents/lb","US Cents","pound","twice monthly",0]
["Scrap","803","MB-AL-0089","New York Mixed Clips scrap dealer buying price delivered to yard cents/lb","US Cents","pound","twice monthly",0]
["Scrap","804","MB-AL-0090","Philadelphia Mixed Clips scrap dealer buying price delivered to yard cents/lb","US Cents","pound","twice monthly",0]
["Scrap","805","MB-AL-0091","Atlanta Mixed Clips scrap dealer buying price delivered to yard cents/lb","US Cents","pound","twice monthly",0]
["Scrap","806","MB-AL-0092","Houston Mixed Clips scrap dealer buying price delivered to yard cents/lb","US Cents","pound","twice monthly",0]
["Scrap","807","MB-AL-0093","Pittsburgh Mixed Clips scrap dealer buying price delivered to yard cents/lb","US Cents","pound","twice monthly",0]
["Scrap","808","MB-AL-0094","Cleveland Mixed Clips scrap dealer buying price delivered to yard cents/lb","US Cents","pound","twice monthly",0]
["Scrap","809","MB-AL-0095","Cincinnati Mixed Clips scrap dealer buying price delivered to yard cents/lb","US Cents","pound","twice monthly",0]
["Scrap","810","MB-AL-0096","Detroit Mixed Clips scrap dealer buying price delivered to yard cents/lb","US Cents","pound","twice monthly",0]
["Scrap","811","MB-AL-0097","Chicago Mixed Clips scrap dealer buying price delivered to yard cents/lb","US Cents","pound","twice monthly",0]
["Scrap","812","MB-AL-0098","St Louis Mixed Clips scrap dealer buying price delivered to yard cents/lb","US Cents","pound","twice monthly",0]
["Scrap","813","MB-AL-0099","San Francisco Mixed Clips scrap dealer buying price delivered to yard cents/lb","US Cents","pound","twice monthly",0]
["Scrap","814","MB-AL-0100","Los Angeles Mixed Clips scrap dealer buying price delivered to yard cents/lb","US Cents","pound","twice monthly",0]
["Scrap","815","MB-AL-0101","Montreal Aluminum borings, turnings, clean & dry scrap dealer buying price delivered to yard cents/lb","CA Cents","pound","twice monthly",0]
["Scrap","816","MB-AL-0102","Toronto Aluminum borings, turnings, clean & dry scrap dealer buying price delivered to yard cents/lb","CA Cents","pound","twice monthly",0]
["Scrap","818","MB-AL-0104","Boston Aluminum borings, turnings, clean & dry scrap dealer buying price delivered to yard cents/lb","US Cents","pound","twice monthly",0]
["Scrap","819","MB-AL-0105","New York Aluminum borings, turnings, clean & dry scrap dealer buying price delivered to yard cents/lb","US Cents","pound","twice monthly",0]
["Scrap","820","MB-AL-0106","Philadelphia Aluminum borings, turnings, clean & dry scrap dealer buying price delivered to yard cents/lb ","US Cents","pound","twice monthly",0]
["Scrap","821","MB-AL-0107","Atlanta Aluminum borings, turnings, clean & dry scrap dealer buying price delivered to yard cents/lb","US Cents","pound","twice monthly",0]
["Scrap","822","MB-AL-0108","Houston Aluminum borings, turnings, clean & dry scrap dealer buying price delivered to yard cents/lb","US Cents","pound","twice monthly",0]
["Scrap","823","MB-AL-0109","Pittsburgh Aluminum borings, turnings, clean & dry scrap dealer buying price delivered to yard cents/lb","US Cents","pound","twice monthly",0]
["Scrap","824","MB-AL-0110","Cleveland Aluminum borings, turnings, clean & dry scrap dealer buying price delivered to yard cents/lb","US Cents","pound","twice monthly",0]
["Scrap","825","MB-AL-0111","Cincinnati Aluminum borings, turnings, clean & dry scrap dealer buying price delivered to yard cents/lb","US Cents","pound","twice monthly",0]
["Scrap","826","MB-AL-0112","Detroit Aluminum borings, turnings, clean & dry scrap dealer buying price delivered to yard cents/lb","US Cents","pound","twice monthly",0]
["Scrap","827","MB-AL-0113","Chicago Aluminum borings, turnings, clean & dry scrap dealer buying price delivered to yard cents/lb","US Cents","pound","twice monthly",0]
["Scrap","828","MB-AL-0114","St Louis Aluminum borings, turnings, clean & dry scrap dealer buying price delivered to yard cents/lb","US Cents","pound","twice monthly",0]
["Scrap","829","MB-AL-0115","San Francisco Aluminum borings, turnings, clean & dry scrap dealer buying price delivered to yard cents/lb","US Cents","pound","twice monthly",0]
["Scrap","830","MB-AL-0116","Los Angeles Aluminum borings, turnings, clean & dry scrap dealer buying price delivered to yard cents/lb","US Cents","pound","twice monthly",0]
["Scrap","831","MB-AL-0117","Montreal Old aluminum sheet & cast scrap dealer buying price delivered to yard cents/lb","CA Cents","pound","twice monthly",0]
["Scrap","832","MB-AL-0118","Toronto Old aluminum sheet & cast scrap dealer buying price delivered to yard cents/lb","CA Cents","pound","twice monthly",0]
["Scrap","834","MB-AL-0120","Boston Old aluminum sheet & cast scrap dealer buying price delivered to yard cents/lb","US Cents","pound","twice monthly",0]
["Scrap","835","MB-AL-0121","New York Old aluminum sheet & cast scrap dealer buying price delivered to yard cents/lb","US Cents","pound","twice monthly",0]
["Scrap","836","MB-AL-0122","Philadelphia Old aluminum sheet & cast scrap dealer buying price delivered to yard cents/lb","US Cents","pound","twice monthly",0]
["Scrap","837","MB-AL-0123","Atlanta Old aluminum sheet & cast scrap dealer buying price delivered to yard cents/lb","US Cents","pound","twice monthly",0]
["Scrap","838","MB-AL-0124","Houston Old aluminum sheet & cast scrap dealer buying price delivered to yard cents/lb","US Cents","pound","twice monthly",0]
["Scrap","839","MB-AL-0125","Pittsburgh Old aluminum sheet & cast scrap dealer buying price delivered to yard cents/lb","US Cents","pound","twice monthly",0]
["Scrap","840","MB-AL-0126","Cleveland Old aluminum sheet & cast scrap dealer buying price delivered to yard cents/lb","US Cents","pound","twice monthly",0]
["Scrap","841","MB-AL-0127","Cincinnati Old aluminum sheet & cast scrap dealer buying price delivered to yard cents/lb","US Cents","pound","twice monthly",0]
["Scrap","842","MB-AL-0128","Detroit Old aluminum sheet & cast scrap dealer buying price delivered to yard cents/lb","US Cents","pound","twice monthly",0]
["Scrap","843","MB-AL-0129","Chicago Old aluminum sheet & cast scrap dealer buying price delivered to yard cents/lb","US Cents","pound","twice monthly",0]
["Scrap","844","MB-AL-0130","St Louis Old aluminum sheet & cast scrap dealer buying price cents per cast pound delivered to yard","US Cents","pound","twice monthly",0]
["Scrap","845","MB-AL-0131","San Francisco Old aluminum sheet & cast scrap dealer buying price delivered to yard cents/lb","US Cents","pound","twice monthly",0]
["Scrap","846","MB-AL-0132","Los Angeles Old aluminum sheet & cast scrap dealer buying price delivered to yard cents/lb","US Cents","pound","twice monthly",0]
["Scrap","847","MB-AL-0133","Montreal Used beverage cans, clean & dry scrap dealer buying price delivered to yard cents/lb","CA Cents","pound","twice monthly",0]
["Scrap","848","MB-AL-0134","Toronto Used beverage cans, clean & dry scrap dealer buying price delivered to yard cents/lb","CA Cents","pound","twice monthly",0]
["Scrap","850","MB-AL-0136","Boston Used beverage cans, clean & dry scrap dealer buying price delivered to yard cents/lb","US Cents","pound","twice monthly",0]
["Scrap","851","MB-AL-0137","New York Used beverage cans, clean & dry scrap dealer buying price delivered to yard cents/lb","US Cents","pound","twice monthly",0]
["Scrap","852","MB-AL-0138","Philadelphia Used beverage cans, clean & dry scrap dealer buying price delivered to yard cents/lb","US Cents","pound","twice monthly",0]
["Scrap","853","MB-AL-0139","Atlanta Used beverage cans, clean & dry scrap dealer buying price delivered to yard cents/lb","US Cents","pound","twice monthly",0]
["Scrap","854","MB-AL-0140","Houston Used beverage cans, clean & dry scrap dealer buying price delivered to yard cents/lb","US Cents","pound","twice monthly",0]
["Scrap","855","MB-AL-0141","Pittsburgh Used beverage cans, clean & dry scrap dealer buying price delivered to yard cents/lb","US Cents","pound","twice monthly",0]
["Scrap","856","MB-AL-0142","Cleveland Used beverage cans, clean & dry scrap dealer buying price delivered to yard cents/lb","US Cents","pound","twice monthly",0]
["Scrap","857","MB-AL-0143","Cincinnati Used beverage cans, clean & dry scrap dealer buying price delivered to yard cents/lb","US Cents","pound","twice monthly",0]
["Scrap","858","MB-AL-0144","Detroit Used beverage cans, clean & dry scrap dealer buying price delivered to yard cents/lb","US Cents","pound","twice monthly",0]
["Scrap","859","MB-AL-0145","Chicago Used beverage cans, clean & dry scrap dealer buying price delivered to yard cents/lb","US Cents","pound","twice monthly",0]
["Scrap","860","MB-AL-0146","St Louis Used beverage cans, clean & dry scrap dealer buying price delivered to yard cents/lb","US Cents","pound","twice monthly",0]
["Scrap","861","MB-AL-0147","San Francisco Used beverage cans, clean & dry scrap dealer buying price delivered to yard cents/lb","US Cents","pound","twice monthly",0]
["Scrap","862","MB-AL-0148","Los Angeles Used beverage cans, clean & dry scrap dealer buying price delivered to yard cents/lb","US Cents","pound","twice monthly",0]
["Scrap","863","MB-AL-0149","Montreal Industrial castings scrap dealer buying price delivered to yard cents/lb","CA Cents","pound","twice monthly",0]
["Scrap","864","MB-AL-0150","Toronto Industrial castings scrap dealer buying price delivered to yard cents/lb","CA Cents","pound","twice monthly",0]
["Scrap","866","MB-AL-0152","Boston Industrial castings scrap dealer buying price delivered to yard cents/lb","US Cents","pound","twice monthly",0]
["Scrap","867","MB-AL-0153","New York Industrial castings scrap dealer buying price delivered to yard cents/lb","US Cents","pound","twice monthly",0]
["Scrap","868","MB-AL-0154","Philadelphia Industrial castings scrap dealer buying price delivered to yard cents/lb","US Cents","pound","twice monthly",0]
["Scrap","869","MB-AL-0155","Atlanta Industrial castings scrap dealer buying price delivered to yard cents/lb","US Cents","pound","twice monthly",0]
["Scrap","870","MB-AL-0156","Houston Industrial castings scrap dealer buying price delivered to yard cents/lb","US Cents","pound","twice monthly",0]
["Scrap","871","MB-AL-0157","Cleveland Industrial castings scrap dealer buying price delivered to yard cents/lb","US Cents","pound","twice monthly",0]
["Scrap","872","MB-AL-0158","Detroit Industrial castings scrap dealer buying price delivered to yard cents/lb","US Cents","pound","twice monthly",0]
["Scrap","873","MB-AL-0159","Chicago Industrial castings scrap dealer buying price delivered to yard cents/lb","US Cents","pound","twice monthly",0]
["Scrap","874","MB-AL-0160","Montreal 63S Aluminum solids scrap dealer buying price delivered to yard cents/lb","CA Cents","pound","twice monthly",0]
["Scrap","875","MB-AL-0161","Toronto 63S Aluminum solids scrap dealer buying price delivered to yard cents/lb","CA Cents","pound","twice monthly",0]
["Scrap","877","MB-AL-0163","Boston 63S Aluminum solids scrap dealer buying price delivered to yard cents/lb","US Cents","pound","twice monthly",0]
["Scrap","878","MB-AL-0164","Atlanta 63S Aluminum solids scrap dealer buying price delivered to yard cents/lb","US Cents","pound","twice monthly",0]
["Scrap","879","MB-AL-0165","Houston 63S Aluminum solids scrap dealer buying price delivered to yard cents/lb","US Cents","pound","twice monthly",0]
["Scrap","880","MB-AL-0166","Philly 63S Aluminum solids scrap dealer buying price delivered to yard cents/lb","US Cents","pound","twice monthly",0]
["Scrap","881","MB-AL-0167","Cleveland 63S Aluminum solids scrap dealer buying price delivered to yard cents/lb","US Cents","pound","twice monthly",0]
["Scrap","882","MB-AL-0168","Detroit 63S Aluminum solids scrap dealer buying price delivered to yard cents/lb","US Cents","pound","twice monthly",0]
["Scrap","883","MB-AL-0169","Chicago 63S Aluminum solids scrap dealer buying price delivered to yard cents/lb","US Cents","pound","twice monthly",0]
["Scrap","884","MB-AL-0170","St Louis 63S Aluminum solids scrap dealer buying price delivered to yard cents/lb","US Cents","pound","twice monthly",0]
["Scrap","885","MB-AL-0171","Montreal 75S Aluminum clips scrap dealer buying price cents pound delivered to yard","CA Cents","pound","twice monthly",0]
["Scrap","886","MB-AL-0172","Toronto 75S Aluminum clips scrap dealer buying price cents pound delivered to yard","CA Cents","pound","twice monthly",0]
["Scrap","888","MB-AL-0174","Boston 75S Aluminum clips scrap dealer buying price cents  pound delivered to yard","US Cents","pound","twice monthly",0]
["Scrap","889","MB-AL-0175","Atlanta 75S Aluminum clips scrap dealer buying price cents  pound delivered to yard","US Cents","pound","twice monthly",0]
["Scrap","890","MB-AL-0176","Houston 75S Aluminum clips scrap dealer buying price cents pound delivered to yard","US Cents","pound","twice monthly",0]
["Scrap","891","MB-AL-0177","Philly 75S Aluminum clips scrap dealer buying price cents pound delivered to yard","US Cents","pound","twice monthly",0]
["Scrap","892","MB-AL-0178","Cleveland 75S Aluminum clips scrap dealer buying price delivered to yard cents/lb","US Cents","pound","twice monthly",0]
["Scrap","893","MB-AL-0179","Detroit 75S Aluminum clips scrap dealer buying price cents pound delivered to yard","US Cents","pound","twice monthly",0]
["Scrap","894","MB-AL-0180","Chicago 75S Aluminum clips scrap dealer buying price delivered to yard cents/lb","US Cents","pound","twice monthly",0]
["Scrap","895","MB-AL-0181","St Louis 75S Aluminum clips scrap dealer buying price cents pound delivered to yard","US Cents","pound","twice monthly",0]
["Scrap","896","MB-AL-0182","San Francisco 75S Aluminum clips scrap dealer buying price delivered to yard cents/lb","US Cents","pound","twice monthly",0]
["Scrap","897","MB-AL-0183","Los Angeles 75S Aluminum clips scrap dealer buying price cents pound delivered to yard","US Cents","pound","twice monthly",0]
["Scrap","898","MB-AL-0184","Montreal 75S Borings, turnings, as is scrap dealer buying price delivered to yard cents/lb","CA Cents","pound","twice monthly",0]
["Scrap","899","MB-AL-0185","Toronto 75S Borings, turnings, as is scrap dealer buying price delivered to yard cents/lb","CA Cents","pound","twice monthly",0]
["Scrap","9","MB-AL-0008","Aluminium Scrap, Cast, Europe, del consumer works, € per tonne","EUR","tonne","Weekly",0]
["Scrap","900","MB-AL-0186","Philly 75S Borings, turnings, as is scrap dealer buying price delivered to yard cents/lb","US Cents","pound","twice monthly",0]
["Scrap","901","MB-AL-0187","Atlanta 75S Borings, turnings, as is scrap dealer buying price delivered to yard cents/lb","US Cents","pound","twice monthly",0]
["Scrap","902","MB-AL-0188","Houston 75S Borings, turnings, as is scrap dealer buying price delivered to yard cents/lb","US Cents","pound","twice monthly",0]
["Scrap","903","MB-AL-0189","Cleveland 75S Borings, turnings, as is scrap dealer buying price delivered to yard cents/lb","US Cents","pound","twice monthly",0]
["Scrap","904","MB-AL-0190","Detroit 75S Borings, turnings, as is scrap dealer buying price delivered to yard cents/lb","US Cents","pound","twice monthly",0]
["Scrap","905","MB-AL-0191","Chicago 75S Borings, turnings, as is scrap dealer buying price delivered to yard cents/lb","US Cents","pound","twice monthly",0]
["Scrap","906","MB-AL-0192","San Francisco 75S Borings, turnings, as is scrap dealer buying price delivered to yard cents/lb","US Cents","pound","twice monthly",0]
["Scrap","907","MB-AL-0193","Los Angeles 75S Borings, turnings, as is scrap dealer buying price delivered to yard cents/lb","US Cents","pound","twice monthly",0]
["Scrap","908","MB-AL-0194","Montreal Aluminum utensils scrap dealer buying price delivered to yard cents/lb","CA Cents","pound","twice monthly",0]
["Scrap","909","MB-AL-0195","Toronto Aluminum utensils scrap dealer buying price delivered to yard cents/lb","CA Cents","pound","twice monthly",0]
["Scrap","911","MB-AL-0197","New York Aluminum utensils scrap dealer buying price delivered to yard cents/lb","US Cents","pound","twice monthly",0]
["Scrap","912","MB-AL-0198","Atlanta Aluminum utensils scrap dealer buying price delivered to yard cents/lb","US Cents","pound","twice monthly",0]
["Scrap","913","MB-AL-0199","Houston Aluminum utensils scrap dealer buying price delivered to yard cents/lb","US Cents","pound","twice monthly",0]
["Scrap","914","MB-AL-0200","Cleveland Aluminum utensils scrap dealer buying price delivered to yard cents/lb","US Cents","pound","twice monthly",0]
["Scrap","915","MB-AL-0201","Detroit Aluminum utensils scrap dealer buying price delivered to yard cents/lb","US Cents","pound","twice monthly",0]
["Scrap","916","MB-AL-0202","Chicago Aluminum utensils scrap dealer buying price delivered to yard cents/lb","US Cents","pound","twice monthly",0]
["Scrap","917","MB-AL-0203","Montreal Painted aluminum siding scrap dealer buying price delivered to yard cents/lb","US Cents","pound","twice monthly",0]
["Scrap","918","MB-AL-0204","Toronto Painted aluminum siding scrap dealer buying price delivered to yard cents/lb","US Cents","pound","twice monthly",0]
["Scrap","920","MB-AL-0206","Boston Painted aluminum siding scrap dealer buying price delivered to yard cents/lb","US Cents","pound","twice monthly",0]
["Scrap","921","MB-AL-0207","Philadelphia Painted aluminum siding scrap dealer buying price delivered to yard cents/lb","US Cents","pound","twice monthly",0]
["Scrap","922","MB-AL-0208","Atlanta Painted aluminum siding scrap dealer buying price delivered to yard cents/lb","US Cents","pound","twice monthly",0]
["Scrap","923","MB-AL-0209","Houston Painted aluminum siding scrap dealer buying price delivered to yard cents/lb","US Cents","pound","twice monthly",0]
["Scrap","924","MB-AL-0210","Cleveland Painted aluminum siding scrap dealer buying price delivered to yard cents/lb","US Cents","pound","twice monthly",0]
["Scrap","925","MB-AL-0211","Detroit Painted aluminum siding scrap dealer buying price delivered to yard cents/lb","US Cents","pound","twice monthly",0]
["Scrap","926","MB-AL-0212","Chicago Painted aluminum siding scrap dealer buying price delivered to yard cents/lb","US Cents","pound","twice monthly",0]
["Scrap","927","MB-AL-0213","St Louis Painted aluminum siding scrap dealer buying price delivered to yard cents/lb","US Cents","pound","twice monthly",0]
["Scrap","928","MB-AL-0214","San Francisco Painted aluminum siding scrap dealer buying price delivered to yard cents/lb","US Cents","pound","twice monthly",0]
["Scrap","929","MB-AL-0215","Los Angeles Painted aluminum siding scrap dealer buying price delivered to yard cents/lb","US Cents","pound","twice monthly",0]
["Scrap","930","MB-AL-0216","Boston Litho sheets scrap dealer buying price delivered to yard cents/lb","US Cents","pound","twice monthly",0]
["Scrap","931","MB-AL-0217","Atlanta Litho sheets scrap dealer buying price delivered to yard cents/lb","US Cents","pound","twice monthly",0]
["Scrap","932","MB-AL-0218","Houston Litho sheets scrap dealer buying price delivered to yard cents/lb","US Cents","pound","twice monthly",0]
["Scrap","933","MB-AL-0219","Detroit Litho sheets scrap dealer buying price delivered to yard cents/lb","US Cents","pound","twice monthly",0]
["Scrap","934","MB-AL-0220","Chicago Litho sheets scrap dealer buying price delivered to yard cents/lb","US Cents","pound","twice monthly",0]
["Scrap","935","MB-AL-0221","St Louis Litho sheets scrap dealer buying price delivered to yard cents/lb","US Cents","pound","twice monthly",0]
["Scrap","936","MB-AL-0222","San Francisco Litho sheets scrap dealer buying price delivered to yard cents/lb","US Cents","pound","twice monthly",0]
["Scrap","937","MB-AL-0223","Los Angeles Litho sheets scrap dealer buying price delivered to yard cents/lb","US Cents","pound","twice monthly",0]
["Scrap","938","MB-ZN-0017","Atlanta New zinc die cast scrap delivered to yard cents/lb","US Cents","pound","twice monthly",0]
["Scrap","939","MB-ZN-0018","Boston New zinc die cast scrap delivered to yard cents/lb","US Cents","pound","twice monthly",0]
["Scrap","941","MB-ZN-0020","Chicago New zinc die cast scrap delivered to yard cents/lb","US Cents","pound","twice monthly",0]
["Scrap","942","MB-ZN-0021","Detroit New zinc die cast scrap delivered to yard cents/lb","US Cents","pound","twice monthly",0]
["Scrap","943","MB-ZN-0022","Houston New zinc die cast scrap delivered to yard cents/lb","US Cents","pound","twice monthly",0]
["Scrap","944","MB-ZN-0023","Los Angeles New zinc die cast scrap delivered to yard cents/lb","US Cents","pound","twice monthly",0]
["Scrap","945","MB-ZN-0024","New York New zinc die cast scrap delivered to yard cents/lb","US Cents","pound","twice monthly",0]
["Scrap","946","MB-ZN-0025","San Francisco New zinc die cast scrap delivered to yard cents/lb","US Cents","pound","twice monthly",0]
["Scrap","947","MB-ZN-0026","St Louis New zinc die cast scrap delivered to yard cents/lb","US Cents","pound","twice monthly",0]
["Scrap","948","MB-ZN-0027","Montreal New zinc die cast scrap delivered to yard cents/lb","CA Cents","pound","twice monthly",0]
["Scrap","949","MB-ZN-0028","Atlanta old zinc die cast scrap delivered to yard cents/lb","US Cents","pound","twice monthly",0]
["Scrap","950","MB-ZN-0029","Boston old zinc die cast scrap delivered to yard cents/lb","US Cents","pound","twice monthly",0]
["Scrap","952","MB-ZN-0031","Chicago old zinc die cast scrap delivered to yard cents/lb","US Cents","pound","twice monthly",0]
["Scrap","953","MB-ZN-0032","Detroit old zinc die cast scrap delivered to yard cents/lb","US Cents","pound","twice monthly",0]
["Scrap","954","MB-ZN-0033","Houston old zinc die cast scrap delivered to yard cents/lb","US Cents","pound","twice monthly",0]
["Scrap","955","MB-ZN-0034","Los Angeles old zinc die cast scrap delivered to yard cents/lb","US Cents","pound","twice monthly",0]
["Scrap","956","MB-ZN-0035","New York old zinc die cast scrap delivered to yard cents/lb","US Cents","pound","twice monthly",0]
["Scrap","957","MB-ZN-0036","San Francisco old zinc die cast scrap delivered to yard cents/lb","US Cents","pound","twice monthly",0]
["Scrap","958","MB-ZN-0037","St Louis old zinc die cast scrap delivered to yard cents/lb","US Cents","pound","twice monthly",0]
["Scrap","959","MB-ZN-0038","Montreal old zinc die cast scrap delivered to yard cents/lb","CA Cents","pound","twice monthly",0]
["Scrap","960","MB-ZN-0039","Toronto old zinc die cast scrap delivered to yard cents/lb","CA Cents","pound","twice monthly",0]
["Scrap","961","MB-ZN-0040","Atlanta old zinc scrap delivered to yard cents/lb","US Cents","pound","twice monthly",0]
["Scrap","962","MB-ZN-0041","Boston old zinc scrap delivered to yard cents/lb","US Cents","pound","twice monthly",0]
["Scrap","964","MB-ZN-0043","Chicago old zinc scrap delivered to yard cents/lb","US Cents","pound","twice monthly",0]
["Scrap","965","MB-ZN-0044","Detroit old zinc scrap delivered to yard cents/lb","US Cents","pound","twice monthly",0]
["Scrap","966","MB-ZN-0045","Houston old zinc scrap delivered to yard cents/lb","US Cents","pound","twice monthly",0]
["Scrap","967","MB-ZN-0046","Los Angeles old zinc scrap delivered to yard cents/lb","US Cents","pound","twice monthly",0]
["Scrap","968","MB-ZN-0047","New York old zinc scrap delivered to yard cents/lb","US Cents","pound","twice monthly",0]
["Scrap","969","MB-ZN-0048","San Francisco old zinc scrap delivered to yard cents/lb","US Cents","pound","twice monthly",0]
["Scrap","97","MB-STS-0008","Europe import 18/8 solids € per tonne cif main European port","EUR","tonne","Weekly",0]
["Scrap","970","MB-ZN-0049","St Louis old zinc scrap delivered to yard cents/lb","US Cents","pound","twice monthly",0]
["Scrap","971","MB-ZN-0050","Motreal old zinc scrap delivered to yard cents/lb","CA Cents","pound","twice monthly",0]
["Scrap","972","MB-ZN-0051","Boston zinc die cast automotive grilles scrap delivered to yard cents/lb","US Cents","pound","twice monthly",0]
["Scrap","973","MB-ZN-0052","Buffalo zinc die cast automotive grilles scrap delivered to yard cents/lb","US Cents","pound","twice monthly",0]
["Scrap","974","MB-ZN-0053","Chicago zinc die cast automotive grilles scrap delivered to yard cents/lb","US Cents","pound","twice monthly",0]
["Scrap","975","MB-ZN-0054","Detroit zinc die cast automotive grilles scrap delivered to yard cents/lb","US Cents","pound","twice monthly",0]
["Scrap","976","MB-ZN-0055","Houston zinc die cast automotive grilles scrap delivered to yard cents/lb","US Cents","pound","twice monthly",0]
["Scrap","977","MB-ZN-0056","St Louis zinc die cast automotive grilles scrap delivered to yard cents/lb","US Cents","pound","twice monthly",0]
["Scrap","978","MB-ZN-0057","Montreal zinc die cast automotive grilles scrap delivered to yard cents/lb","CA Cents","pound","twice monthly",0]
["Scrap","98","MB-STS-0009","Europe import 18/8 turnings € per tonne cif main European port","EUR","tonne","Weekly",0]
["Steel","1079","MB-STE-0212","Hot Dipped Galvanized Steel Coil, US Domestic Midwest FOB mill US$/CWT","USD","cwt","weekly",0]
["Steel","130","MB-STE-0055","Import ERW line pipe (X42) c&f $/short ton ","USD","short ton","monthly",0]
["Steel","131","MB-STE-0056","Import ERW standard pipe A53 Grade A  c&f $/short ton","USD","short ton","monthly",0]
["Steel","132","MB-STE-0057","Import ERW standard pipe A53 Grade B  c&f $/short ton","USD","short ton","monthly",0]
["Steel","133","MB-STE-0058","Import OCTG API 5CT - Casing J55 c&f $/short ton","USD","short ton","monthly",0]
["Steel","134","MB-STE-0059","Import seamless line pipe - API 5LB c&f $/short ton","USD","short ton","monthly",0]
["Steel","135","MB-STE-0060","Import seamless OCTG API 5CT - Casing L80 c&f $/short ton","USD","short ton","monthly ",0]
["Steel","137","MB-STE-0062","Import seamless OCTG API 5CT - Casing P110 c&f $/short ton","USD","short ton","monthly ",0]
["Steel","1388","MB-STS-0137","EU domestic Stainless Steel 304 Index $ per tonne exw","USD","tonne","weekly",0]
["Steel","1422","MB-STE-0433","Indian domestic billet rupees per tonne ex-works","USD","tonne","weekly",0]
["Steel","1423","MB-STE-0434","India domestic hot-dip galvanized coil rupees per tonne exw","INR","tonne","weekly",0]
["Steel","1424","MB-STE-0435","India domestic cold rolled coil rupees per tonne ex-works","INR","tonne","weekly",0]
["Steel","1425","MB-STE-0436","India domestic hot rolled coil rupees per tonne exw","INR","tonne","weekly",0]
["Steel","1427","MB-STE-0437","India domestic heavy plate rupees per tonne exw","INR","tonne","weekly",0]
["Steel","1428","MB-STE-0438","India domestic rebar rupees per tonne ex works","INR","tonne","weekly",0]
["Steel","1429","MB-STE-0439","India export heavy plate (12-40mm) $ per tonne fob main port","USD","tonne","weekly",0]
["Steel","1430","MB-STE-0440","India export billet $ per tonne fob main port","USD","tonne","weekly",0]
["Steel","1431","MB-STE-0441","India export hot-dip galvanized coil FOB main port $/tonne","USD","tonne","weekly",0]
["Steel","1432","MB-STE-0442","India export hot rolled coil (commodity) $ per tonne fob main port","USD","tonne","weekly",0]
["Steel","1433","MB-STE-0443","India import cold rolled coil $ per tonne cfr main port","USD","tonne","weekly",0]
["Steel","1434","MB-STE-0444","India import hot rolled coil $ per tonne cfr main port","USD","tonne","weekly",0]
["Steel","1435","MB-STE-0445","India import hot rolled coil (CR grade) $ per tonne cfr main port","USD","tonne","weekly",0]
["Steel","1436","MB-STE-0446","India import heavy plate (20-60mm) $ per tonne cfr main port","USD","tonne","weekly",0]
["Steel","1460","MB-STE-0453","Iran import cold rolled coil $ per tonne cfr Iranian ports","USD","tonne","weekly",0]
["Steel","1461","MB-STE-0454","Iran import hot rolled coil $ per tonne cfr Iranian ports","USD","tonne","weekly",0]
["Steel","152","MB-STE-0063","OCTG API 5CT - Casing J55 FOB mill $/short ton","USD","short ton","monthly",0]
["Steel","153","MB-STE-0064","Russian domestic cold rolled sheet rubles per tonne carriage paid (cpt) inc VAT","RUB","tonne","weekly",0]
["Steel","1531","MB-STE-0465","Reinforcing Bar, Domestic US f.o.b. mill US $ per short ton","USD","short ton","twice weekly",0]
["Steel","1535","MB-STE-0469","Cold-rolled sheet (CRC) US domestic Midwest FOB mill US$/short ton","USD","short ton","weekly",0]
["Steel","154","MB-STE-0065","Russian domestic hot rolled sheet rubles per tonne carriage paid (cpt) inc VAT","RUB","tonne","weekly",0]
["Steel","155","MB-STE-0066","Russian domestic rebar rubles per tonne carriage paid (cpt) inc VAT","RUB","tonne","weekly",0]
["Steel","1550","MB-STE-0471","Mesh Quality Low Carbon, Wire Rod, domestic US, f.o.b. mill, US $ per short ton","USD","short ton","twice weekly",0]
["Steel","157","MB-STE-0068","Seamless mechanical - ASTM A519 FOB mill $/short ton","USD","short ton","monthly ",0]
["Steel","158","MB-STE-0069","Seamless OCTG API 5CT - Casing L80 FOB mill $/short ton","USD","short ton","monthly",0]
["Steel","160","MB-STE-0071","Seamless OCTG API 5CT - Casing P110 FOB mill $/short ton","USD","short ton","monthly",0]
["Steel","168","MB-STE-0072","Southern China domestic hot-dip galvanized coil yuan per tonne del warehouse","RMB","tonne","weekly",0]
["Steel","169","MB-STE-0073","Southern Europe export rebar € per tonne fob main port","EUR","tonne","weekly",0]
["Steel","170","MB-STE-0074","Southern Europe export wire rod (mesh quality) € per tonne fob main port","EUR","tonne","weekly",0]
["Steel","1778","MB-STE-0514","Russian domestic plate rubles per tonne carriage paid (cpt) inc VAT ","RUB","tonne","weekly",0]
["Steel","1786","MB-STE-0516","Egypt import billet $ per tonne cfr main port ","USD","tonne","twice weekly",0]
["Steel","1861","MB-STE-0517","Algeria import rebar € per tonne cfr main port","EUR","tonne","weekly",0]
["Steel","199","MB-STE-0090","Welded mechanical tubing ASTM A513 FOB mill  $/short ton","USD","short ton","monthly",0]
["Steel","2003","MB-STE-0532","Central Europe domestic hot-rolled coil, € per tonne ex works ","EUR","tonne","weekly",0]
["Steel","201","MB-STE-0091","EU import hot-dip galvanized coil € per tonne cfr main EU port Northern Europe","EUR","tonne","weekly",0]
["Steel","202","MB-STE-0092","Poland domestic rebar ex-works","PLN","tonne","weekly",0]
["Steel","2051","MB-STE-0545","Domestic ERW line pipe (X52) FOB US mill $/short ton","USD","short ton","monthly",0]
["Steel","2052","MB-STE-0546","Import ERW line pipe (X52) c&f Port of Houston $/short ton","USD","short ton","monthly",0]
["Steel","211","MB-STE-0101","South America plate import $ per tonne cfr main ports","USD","tonne","weekly",0]
["Steel","212","MB-STE-0102","South America import hot rolled coil $ per tonne cfr main ports","USD","tonne","weekly",0]
["Steel","213","MB-STE-0103","South America import cold rolled coil $ per tonne cfr main ports","USD","tonne","weekly",0]
["Steel","215","MB-STE-0105","Turkey import hot rolled coil $ per tonne cfr main port","USD","tonne","weekly",0]
["Steel","216","MB-STE-0106","Turkey import cold rolled coil $ per tonne cfr main port","USD","tonne","weekly",0]
["Steel","217","MB-STE-0107","Turkey export hot rolled coil $ per tonne fob main port","USD","tonne","weekly",0]
["Steel","218","MB-STE-0108","Turkey domestic hot rolled coil $ per tonne exw","USD","tonne","weekly",0]
["Steel","219","MB-STE-0109","Turkey domestic cold rolled coil $ per tonne exw","USD","tonne","weekly",0]
["Steel","220","MB-STE-0110","Turkey domestic hot dip galvanized $ per tonne ex-works","USD","tonne","weekly",0]
["Steel","221","MB-STE-0111","Turkey domestic prepainted galvanized steel $ per tonne ex works ","USD","tonne","twice weekly",0]
["Steel","222","MB-STE-0112","Egypt domestic rebar E£ per tonne exw","GBP","tonne","weekly",0]
["Steel","223","MB-STE-0113","Saudi Arabia import hot rolled coil $ per tonne cfr","USD","tonne","weekly",0]
["Steel","224","MB-STE-0114","Saudi Arabia import rebar $ per tonne cfr","USD","tonne","weekly",0]
["Steel","225","MB-STE-0115","Turkey domestic billet $ per tonne exw","USD","tonne","weekly",0]
["Steel","226","MB-STE-0116","Turkey import billet $ per tonne cfr main port","USD","tonne","weekly",0]
["Steel","227","MB-STE-0117","Turkey export billet $ per tonne fob main port","USD","tonne","weekly",0]
["Steel","228","MB-FE-0001","Turkey export merchant bar $ per tonne fob main Turkish port","USD","tonne","weekly",0]
["Steel","229","MB-STE-0118","Turkey domestic rebar $ per tonne exw","USD","tonne","weekly",0]
["Steel","230","MB-STE-0119","Turkey export reinforcing bar (rebar) FOB main port $/tonne ","USD","tonne","weekly",0]
["Steel","231","MB-STE-0120","Turkey export wire rod (mesh quality) FOB main port $/tonne ","USD","tonne","weekly",0]
["Steel","232","MB-STE-0121","Turkey domestic wire rod (mesh quality) $ per tonne exw","USD","tonne","weekly",0]
["Steel","233","MB-STE-0122","UAE import billet $ per tonne cfr Jebel Ali","USD","tonne","weekly",0]
["Steel","234","MB-STE-0123","UAE import hot dip-galvanized coil $ per tonne cfr Jebel Ali ","USD","tonne","weekly",0]
["Steel","235","MB-STE-0124","UAE import cold rolled coil $ per tonne cfr Jebel Ali","USD","tonne","weekly",0]
["Steel","236","MB-STE-0125","UAE import hot rolled coil $ per tonne cfr Jebel Ali","USD","tonne","weekly",0]
["Steel","237","MB-STE-0126","UAE domestic rebar UAE dirhams per tonne exw","AED","tonne","weekly",0]
["Steel","238","MB-STE-0127","UAE import rebar $ per tonne cfr Jebel Ali","USD","tonne","weekly",0]
["Steel","239","MB-STE-0128","Latin America export billet $ per tonne fob main port","USD","tonne","weekly",0]
["Steel","240","MB-STE-0129","Latin America export rebar $ per tonne fob main port","USD","tonne","weekly",0]
["Steel","241","MB-STE-0130","Latin America export wire rod (mesh quality) $ per tonne fob main port","USD","tonne","weekly",0]
["Steel","242","MB-STE-0131","Latin America export hot-dip galvanized coil $ per tonne fob main port","USD","tonne","weekly",0]
["Steel","243","MB-STE-0132","Latin America export cold rolled coil $ per tonne fob main port","USD","tonne","weekly",0]
["Steel","244","MB-STE-0133","Latin America export hot rolled coil (dry) $ per tonne fob main port","USD","tonne","weekly",0]
["Steel","245","MB-STE-0134","Latin America export heavy plate (thicker than 10mm) $ per tonne fob main port","USD","tonne","weekly",0]
["Steel","246","MB-STE-0135","Latin America export slab $ per tonne fob main port","USD","tonne","weekly",0]
["Steel","25","MB-STE-0001","Argentina domestic cold rolled coil ex-works $ per tonne monthly assessment","USD","tonne","monthly",0]
["Steel","263","MB-STE-0139","South East Asia Import Hot rolled coil $ per tonne cfr (Vietnam)","USD","tonne","weekly",0]
["Steel","2637","MB-STE-0558","CIS export billet index $ per tonne fob Black Sea","USD","tonne","weekly",0]
["Steel","264","MB-STE-0140","South East Asia /East Asia Import Slab $ per tonne cfr","USD","tonne","weekly",0]
["Steel","265","MB-STE-0141","South East Asia Import Billet $ per tonne cfr","USD","tonne","weekly",0]
["Steel","266","MB-STE-0142","South East Asia Import Rebar $ per tonne cfr (Singapore)","USD","tonne","weekly",0]
["Steel","267","MB-STE-0143","South East Asia Import Wire rod (low carbon) $ per tonne cfr","USD","tonne","weekly",0]
["Steel","268","MB-STE-0144","China export hot rolled coil $ per tonne fob main port","USD","tonne","weekly",0]
["Steel","269","MB-STE-0145","China export cold rolled coil FOB main port $/tonne ","USD","tonne","weekly",0]
["Steel","27","MB-STE-0003","Argentina domestic hot rolled coil ex-works $ per tonne monthly assessment","USD","tonne","monthly",0]
["Steel","270","MB-STE-0146","China export heavy plate $ per tonne fob main port","USD","tonne","weekly",0]
["Steel","271","MB-STE-0147","China export rebar $ per tonne fob main port","USD","tonne","weekly",0]
["Steel","272","MB-STE-0148","China export wire rod (mesh quality) FOB main port $/tonne ","USD","tonne","weekly",0]
["Steel","273","MB-STS-0015","China domestic grade 304 stainless steel cold rolled coil (2mm) yuan per tonne in-warehouse","RMB","tonne","weekly",0]
["Steel","274","MB-STS-0016","China domestic grade 430 2mm stainless steel cold rolled coil yuan per tonne in-warehouse","RMB","tonne","weekly",0]
["Steel","277","MB-STE-0150","Southern China domestic hot rolled coil yuan per tonne ex-warehouse","RMB","tonne","weekly",0]
["Steel","278","MB-STE-0151","Southern China domestic cold rolled coil yuan per tonne del","RMB","tonne","weekly",0]
["Steel","279","MB-STE-0152","Eastern China domestic rebar yuan per tonne del","RMB","tonne","daily",0]
["Steel","280","MB-STE-0153","Eastern China domestic cold rolled coil yuan per tonne del","RMB","tonne","weekly",0]
["Steel","281","MB-STE-0154","Eastern China domestic hot rolled coil yuan per tonne ex-warehouse","RMB","tonne","daily",0]
["Steel","282","MB-STE-0155","Eastern China domestic plate yuan per tonne del warehouse","RMB","tonne","weekly",0]
["Steel","283","MB-STE-0156","Southern China domestic plate yuan per tonne del warehouse","RMB","tonne","weekly",0]
["Steel","284","MB-STE-0157","Northern China Tangshan Domestic Billet ex-works Yuan per tonne","RMB","tonne","daily",0]
["Steel","285","MB-STE-0158","Northern China Domestic Hot Rolled Coil Delivered Yuan per tonne","RMB","tonne","weekly",0]
["Steel","288","MB-STS-0017","Asia grade 304 stainless steel hot rolled sheet $ per tonne cif East Asian port","USD","tonne","weekly",0]
["Steel","289","MB-STS-0018","Asia grade 304 stainless steel cold rolled coil (2mm 2B) $ per tonne cif East Asian port","USD","tonne","weekly",0]
["Steel","290","MB-STE-0160","Southern China domestic sections yuan per tonne del warehouse","RMB","tonne","weekly",0]
["Steel","291","MB-STE-0161","Eastern China domestic sections yuan per tonne del warehouse","RMB","tonne","weekly",0]
["Steel","292","MB-STE-0162","Northern China Domestic Rebar Delivered Yuan per tonne","RMB","tonne","weekly",0]
["Steel","293","MB-STE-0163","Southern China domestic rebar yuan per tonne del","RMB","tonne","weekly",0]
["Steel","294","MB-STE-0164","Eastern China domestic wire rod (mesh quality) yuan per tonne del","RMB","tonne","weekly",0]
["Steel","295","MB-STE-0165","Southern China domestic wire rod (mesh quality) yuan per tonne del","RMB","tonne","weekly",0]
["Steel","296","MB-COA-0001","China Hard Coking Coal Shanxi spot market domestic delivered Yuan per tonne","RMB","tonne","weekly",0]
["Steel","300","MB-STE-0166","Turkey export S235JR grade EN10219 2mm wall thickness structural pipe $ per tonne fob main port","USD","tonne","monthly",0]
["Steel","306","MB-STE-0170","Steel bar reinforcing bar (rebar) domestic US FOB mill US$/CWT","USD","cwt","twice weekly",0]
["Steel","307","MB-STE-0171","Steel bar reinforcing bar (rebar) import US CFR Port of Houston US$/short ton","USD","short ton","twice weekly",0]
["Steel","315","MB-STE-0172","Cut-to-length Plate Carbon Grade FOB US mill US$/CWT","USD","cwt","weekly",0]
["Steel","316","MB-STE-0173","Coiled Plate Carbon Grade FOB US mill US$/CWT","USD","cwt","weekly",0]
["Steel","32","MB-STE-0005","Brazil domestic cold rolled coil ex-works Reais per tonne monthly","BRL","tonne","monthly",0]
["Steel","320","MB-STE-0177","Alloy Steel Plate FOB US mill US$/CWT","USD","cwt","weekly",0]
["Steel","322","MB-STE-0179","Medium Plate US import CFR Port of Houston US$/short ton","USD","short ton","twice weekly",0]
["Steel","323","MB-STE-0180","Hot-rolled coil (HRC) US import CFR Port of Houston US$/short ton","USD","short ton","twice weekly",0]
["Steel","324","MB-STE-0181","Cold-rolled coil (CRC) US import CFR Port of Houston US$/short ton","USD","short ton","twice weekly",0]
["Steel","325","MB-STE-0182","Hot-dipped galvanized  (HDG) 0.012-0.015\" G30 CFR Port of Houston US$/short ton","USD","short ton","twice weekly",0]
["Steel","327","MB-STE-0184","Hot-rolled coil index US domestic Midwest FOB mill US$/CWT","USD","cwt","weekly",0]
["Steel","328","MB-STE-0185","Cold-rolled coil (CRC) US domestic Midwest FOB mill US$/CWT","USD","cwt","weekly",0]
["Steel","329","MB-STE-0186","Hot-dipped galvanized (HDG) steel coil base US Domestic Midwest FOB mill US$/CWT","USD","cwt","weekly",0]
["Steel","330","MB-STE-0187","Galvalume Steel Coil US domestic Midwest FOB mill US$/CWT","USD","cwt","monthly",0]
["Steel","331","MB-STE-0188","Electrogalvanized Steel Coil US domestic Midwest FOB mill US$/CWT","USD","cwt","monthly ",0]
["Steel","332","MB-STE-0189","Aluminized Steel Sheet Type 1 US Domestic Midwest FOB mill US$/CWT","USD","cwt","weekly",0]
["Steel","333","MB-STE-0190","Motor Lamination Steel Sheet US Domestic Midwest FOB mill US$/CWT","USD","cwt","monthly",0]
["Steel","334","MB-STE-0191","Mesh quality low carbon Wire Rod domestic US FOB mill US$/CWT","USD","cwt","twice weekly",0]
["Steel","335","MB-STE-0192","Industrial quality low carbon Wire Rod domestic US FOB mill US$/CWT","USD","cwt","twice weekly",0]
["Steel","336","MB-STE-0193","High carbon wire rod domestic US FOB mill US$/CWT","USD","cwt","twice weekly",0]
["Steel","337","MB-STE-0194","Cold heading quality wire rod domestic US FOB mill US$/CWT","USD","cwt","twice weekly",0]
["Steel","338","MB-STE-0195","Low carbon wire rod Import US CFR port of Houston US$/short ton","USD","short ton","twice weekly",0]
["Steel","339","MB-STE-0196","Argentina domestic rebar ex-works $ per tonne monthly assessment","USD","tonne","monthly",0]
["Steel","34","MB-STE-0007","Brazil domestic hot rolled coil ex-works Reais per tonne monthly","BRL","tonne","monthly",0]
["Steel","35","MB-STE-0008","Brazil domestic rebar delivered Reais per tonne monthly","USD","tonne","monthly",0]
["Steel","372","MB-STS-0019","Stainless Steel 303 Bar FOB US mill US$/CWT","USD","cwt","monthly",0]
["Steel","373","MB-STS-0020","Stainless Steel 304 Bar FOB US mill US$/CWT","USD","cwt","monthly",0]
["Steel","374","MB-STS-0021","Stainless Steel 316 Bar FOB US mill US$/CWT","USD","cwt","monthly",0]
["Steel","375","MB-STS-0022","Stainless Steel 416 Bar FOB US mill US$/CWT","USD","cwt","monthly",0]
["Steel","376","MB-STS-0023","Stainless Steel 17Cr4Ni Bar FOB US mill US$/CWT","USD","cwt","monthly",0]
["Steel","377","MB-STS-0024","Stainless Steel 304 Coiled Plate FOB US mill US$/CWT","USD","cwt","monthly",0]
["Steel","378","MB-STS-0025","Stainless Steel 304L Coiled Plate FOB US mill US$/CWT","USD","cwt","twice weekly",0]
["Steel","379","MB-STS-0026","Stainless Steel 316 Coiled Plate FOB US mill US$/CWT","USD","cwt","monthly",0]
["Steel","38","MB-STE-0009","China export galvanized coil (1mm) FOB main port $/tonne","USD","tonne","weekly",0]
["Steel","380","MB-STS-0027","Stainless Steel 316L Coiled Plate FOB US mill US$/CWT","USD","cwt","twice weekly",0]
["Steel","387","MB-STS-0034","Stainless Steel 304L Cold Rolled Sheet FOB US mill US$/CWT","USD","cwt","twice weekly",0]
["Steel","388","MB-STS-0035","Stainless Steel 304 Cold Rolled Sheet FOB US mill US$/CWT","USD","cwt","twice monthly",0]
["Steel","390","MB-STS-0037","Stainless Steel 316L Cold Rolled Sheet FOB US mill US$/CWT","USD","cwt","twice monthly",0]
["Steel","428","MB-STE-0199","Steel bar  2 x 2 x 1/4\" angle merchant products FOB US mill US$/CWT","USD","cwt","monthly",0]
["Steel","429","MB-STE-0200","Steel bar  3 x 3 x 1/4\" angle merchant products US$/CWT FOB US mill","USD","cwt","monthly",0]
["Steel","43","MB-STE-0012","CIS export cold rolled coil FOB Black Sea $/tonne","USD","tonne","weekly",0]
["Steel","430","MB-STE-0201","Steel bar 8 x 11.5 channels merchant products FOB US mill US$/CWT","USD","cwt","monthly",0]
["Steel","431","MB-STE-0202","Steel bar 1/2 x 4\" flat merchant products FOB US mill US$/CWT","USD","cwt","monthly",0]
["Steel","432","MB-STE-0203","Steel merchant Bar US import CFR Port of Houston US$/short ton","USD","short ton","monthly",0]
["Steel","433","MB-STE-0204","Steel bar cold-finished 1\" round 4140 (alloy) FOB US mill US$/CWT","USD","cwt","monthly",0]
["Steel","434","MB-STE-0205","Steel bar cold-finished 1\" round 1018 (carbon) FOB US mill US$/CWT","USD","cwt","monthly",0]
["Steel","435","MB-STE-0206","Steel bar cold-finished 1\" round 12L14 (carbon) FOB US mill US$/CWT","USD","cwt","monthly",0]
["Steel","436","MB-STE-0207","Steel bar hot-rolled special bar quality (SBQ) 1\" round 4100 series (alloy) FOB US mill US$/CWT","USD","cwt","monthly",0]
["Steel","437","MB-STE-0208","Steel bar hot-rolled special bar quality (SBQ) 1\" round 1000 series (carbon) FOB US mill US$/CWT","USD","cwt","monthly",0]
["Steel","438","MB-STE-0209","Steel beams 8 x 8-inch FOB US mill US$/CWT","USD","cwt","monthly ",0]
["Steel","439","MB-STE-0210","Steel beams medium sections import CFR Port of Houston US$/short ton","USD","short ton","monthly",0]
["Steel","44","MB-STE-0013","CIS export heavy plate (10-50mm) $ per tonne fob Black Sea","USD","tonne","weekly",0]
["Steel","45","MB-STE-0014","CIS export hot rolled coil FOB Black Sea  $/tonne","USD","tonne","weekly",0]
["Steel","48","MB-STE-0015","CIS export rebar $ per tonne fob Black Sea","USD","tonne","weekly",0]
["Steel","49","MB-STE-0016","CIS export slab $ per tonne fob Black Sea","USD","tonne","weekly",0]
["Steel","50","MB-STE-0017","CIS export wire rod (mesh quality) $ per tonne fob Black Sea","USD","tonne","weekly",0]
["Steel","51","MB-STE-0018","Cold drawn seamless mechanical FOB mill $/short ton","USD","short ton","monthly ",0]
["Steel","54","MB-STE-0020","Domestic hollow sections ex-mill ASTM A500 $/short ton","USD","short ton","weekly",0]
["Steel","55","MB-STE-0021","Eastern China domestic hot-dip galvanized coil yuan per tonne del warehouse","RMB","tonne","weekly",0]
["Steel","56","MB-STE-0022","ERW standard pipe A53 Grade A FOB mill  $/short ton","USD","short ton","monthly",0]
["Steel","57","MB-STE-0023","ERW standard pipe A53 Grade B FOB mill  $/short ton","USD","short ton","monthly",0]
["Steel","58","MB-STS-0001","EU domestic 316 2mm cold rolled stainless sheet alloy surcharge delivered € per tonne","EUR","tonne","weekly",0]
["Steel","59","MB-STS-0002","EU domestic 316 2mm cold rolled stainless sheet base price delivered € per tonne","EUR","tonne","weekly",0]
["Steel","60","MB-STE-0024","EU domestic beams € per tonne del Northern Europe","EUR","tonne","weekly",0]
["Steel","61","MB-STE-0025","EU domestic beams € per tonne del Southern Europe","EUR","tonne","weekly",0]
["Steel","62","MB-STE-0026","EU domestic cold rolled coil € per tonne ex-works Northern Europe","EUR","tonne","weekly",0]
["Steel","63","MB-STE-0027","EU domestic cold rolled coil € per tonne ex-works Southern Europe","EUR","tonne","weekly",0]
["Steel","64","MB-STE-0028","EU domestic hot rolled coil € per tonne ex-works Northern Europe","EUR","tonne","weekly",0]
["Steel","65","MB-STE-0029","EU domestic hot rolled coil € per tonne ex-works Southern Europe","EUR","tonne","weekly",0]
["Steel","66","MB-STE-0030","EU domestic hot-dip galvanized coil € per tonne ex-works Northern Europe","EUR","tonne","weekly",0]
["Steel","67","MB-STE-0031","EU domestic hot-dip galvanized coil € per tonne ex-works Southern Europe","EUR","tonne","weekly",0]
["Steel","70","MB-STE-0034","EU domestic plate (8-40mm) € per tonne ex-works Northern Europe","EUR","tonne","weekly",0]
["Steel","71","MB-STE-0035","EU domestic plate (8-40mm) € per tonne ex-works Southern Europe","EUR","tonne","weekly",0]
["Steel","72","MB-STE-0036","EU domestic rebar € per tonne del Northern Europe","EUR","tonne","weekly",0]
["Steel","73","MB-STE-0037","EU domestic rebar € per tonne del Southern Europe","EUR","tonne","weekly",0]
["Steel","74","MB-STE-0038","EU domestic sections (medium) € per tonne del Northern Europe","EUR","tonne","weekly",0]
["Steel","75","MB-STE-0039","EU domestic sections (medium) € per tonne del Southern Europe","EUR","tonne","weekly",0]
["Steel","78","MB-STE-0042","EU domestic wire rod (mesh quality) € per tonne del Northern Europe","EUR","tonne","weekly",0]
["Steel","79","MB-STE-0043","EU domestic wire rod (mesh quality) € per tonne del Southern Europe","EUR","tonne","weekly",0]
["Steel","80","MB-STS-0003","EU export grade 304 stainless steel cold rolled sheet (2mm) € per tonne fob North European port","EUR","tonne","weekly",0]
["Steel","81","MB-STE-0044","EU import cold rolled coil € per tonne cfr main EU port Northern Europe","EUR","tonne","weekly",0]
["Steel","82","MB-STE-0045","EU import cold rolled coil € per tonne cfr main EU port Southern Europe","EUR","tonne","weekly",0]
["Steel","83","MB-STE-0046","EU import Hot rolled coil € per tonne cfr main EU port Northern Europe","EUR","tonne","weekly",0]
["Steel","84","MB-STE-0047","EU import Hot rolled coil € per tonne cfr main EU port Southern Europe","EUR","tonne","weekly",0]
["Steel","85","MB-STE-0048","EU import hot-dip galvanized coil € per tonne cfr main EU port Southern Europe","EUR","tonne","weekly",0]
["Steel","86","MB-STE-0049","EU import Plate (8-40mm) € per tonne cfr main EU port Northern Europe","EUR","tonne","weekly",0]
["Steel","87","MB-STE-0050","EU import Plate (8-40mm) € per tonne cfr main EU port Southern Europe","EUR","tonne","weekly",0]
["Steel","88","MB-STE-0051","EU import rebar € per tonne cfr main EU port Northern Europe","EUR","tonne","weekly",0]
["Steel","89","MB-STE-0052","EU import rebar € per tonne cfr main EU port Southern Europe","EUR","tonne","weekly",0]
["Steel","90","MB-STE-0053","EU import wire rod (mesh quality) € per tonne cfr main EU port Northern Europe","EUR","tonne","weekly",0]
["Steel","91","MB-STE-0054","EU import wire rod (mesh quality) € per tonne cfr main EU port Southern Europe","EUR","tonne","weekly",0]
["Steel","93","MB-STS-0004","Europe domestic grade 304 stainless steel bright bar alloy surcharge € per tonne exw","EUR","tonne","weekly",0]
["Steel","94","MB-STS-0005","Europe domestic grade 304 stainless steel bright bar base price € per tonne del","EUR","tonne","weekly",0]
["Steel","95","MB-STS-0006","Europe domestic grade 304 stainless steel cold rolled sheet  (2mm) alloy surcharge € per tonne","EUR","tonne","weekly",0]
["Steel","96","MB-STS-0007","Northern Europe domestic grade 304 stainless steel cold rolled sheet  (2mm) base price € per tonne del","EUR","tonne","weekly",0]
["Steel Raw Material",3585,"MB-IRO-0144","Iron Ore 62% Fe Iron Ores Fines Low Alumina index CFR Qingdao US $ per dry metric tonne","USD","tonne","daily",0]
["Steel Raw Material",3590,"MB-COA-0007","Low Vol PCI Index $ per dry metric tonne cfr Jingtang","USD","tonne","daily",0]
["Steel Raw Material",3591,"MB-COA-0008","Low Vol PCI Index $ per dry metric tonne fob DBCT","USD","tonne","daily",0]
["Steel Raw Material","1080","MB-IRO-0014","EU pig iron imports $ per tonne cif Italy","USD","tonne","weekly",0]
["Steel Raw Material","1384","MB-COA-0002","Hard Coking Coal Index $ per dry metric tonne cfr Jingtang","USD","dry metric tonne","daily",0]
["Steel Raw Material","1385","MB-COA-0003","Premium Hard Coking Coal Index $ per dry metric tonne fob DBCT","USD","dry metric tonne","daily",0]
["Steel Raw Material","1386","MB-COA-0004","Hard Coking Coal Index $ per dry metric tonne fob DBCT","USD","dry metric tonne","daily",0]
["Steel Raw Material","1387","MB-COA-0005","Premium Hard Coking Coal Index $ per dry metric tonne cfr Jingtang","USD","dry metric tonne","daily",0]
["Steel Raw Material","1389","MB-IRO-0015","Iron Ore 58% Fe delivered to China, normalized to Qingdao US $ per tonne","USD","tonne","daily",0]
["Steel Raw Material","1390","MB-IRO-0016","Iron Ore 58% Fe High Grade Premium CFR Qingdao US $ per tonne","USD","tonne","daily",0]
["Steel Raw Material","1391","MB-IRO-0017","Iron Ore 58%Fe High Grade Premium Index US $ per tonne CFR Qingdao","USD","tonne","daily",0]
["Steel Raw Material","1392","MB-IRO-0018","Iron Ore Fines 62% Fe, % Fe value in use cfr Qingdao $ per dry metric tonne","USD","dry metric tonne","monthly",0]
["Steel Raw Material","1393","MB-IRO-0019","Iron Ore Fines 65% Fe, % Fe value in use cfr Qingdao $ per dry metric tonne","USD","dry metric tonne","monthly",0]
["Steel Raw Material","1394","MB-IRO-0020","Iron Ore Fines 62% Fe, % Si value in use cfr Qingdao $ per dry metric tonne","USD","dry metric tonne","monthly",0]
["Steel Raw Material","1395","MB-IRO-0021","Iron Ore Fines 62% Fe, % Al2O3 value in use cfr Qingdao $ per dry metric tonne","USD","dry metric tonne","monthly",0]
["Steel Raw Material","1412","MB-IRO-0022","Iron Ore 62% Fe sinter fines, FOT main Chinese ports, US $ per tonne","USD","tonne","daily",0]
["Steel Raw Material","1426","MB-IRO-0023","India domestic direct reduced iron rupees per tonne exw","INR","tonne","weekly",0]
["Steel Raw Material","1778","MB-STE-0514","Russian domestic plate rubles per tonne carriage paid (cpt) inc VAT","RUB","tonne","weekly",0]
["Steel Raw Material","1786","MB-STE-0516","Egypt import billet $ per tonne cfr main port","USD","tonne","weekly",0]
["Steel Raw Material","1788","MB-COA-0006","65% CSR Coke $ per tonne FOB Tianjin","USD","tonne","weekly",0]
["Steel Raw Material","1844","MB-IRO-0024","Iron Ore Fines 62% Fe, 0.01% Phosphorous value in use cfr Qingdao US cent per dry metric tonne","US Cents","dry metric tonne","monthly",0]
["Steel Raw Material","1975","MB-IRO-0025","Metal Bulletin 60% Fe Iranian Fines Index (MBIOI-IR) CFR China $ per dry metric tonne","EUR","dry metric tonne","weekly",0]
["Steel Raw Material","248","MB-IRO-0004","USA import pig iron $ per tonne cfr Gulf","USD","tonne","weekly",0]
["Steel Raw Material","249","MB-IRO-0005","Latin America exports pig iron $ per tonne fob Vitorio/Rio Brazil","USD","tonne","weekly",0]
["Steel Raw Material","250","MB-IRO-0006","Latin America exports pig iron $ per tonne fob Ponta da Madeira Brazil","USD","tonne","weekly",0]
["Steel Raw Material","251","MB-FE-0002","Venezuelan export hot briquetted iron $ per tonne fob main port","USD","tonne","weekly",0]
["Steel Raw Material","2579","MB-IRO-0076","DR-Grade Pellet Premium Index (MBIOI-DRP $/dry tonne)","USD","dry tonne","monthly",0]
["Steel Raw Material","2656","MB-IRO-0078","Brazilian basic pig iron FOB NOLA US$/tonne","USD","tonne","Weekly",0]
["Steel Raw Material","2657","MB-FEN-0004","Brazilian foundry pig iron FOB NOLA US$/tonne","USD","tonne","Weekly",0]
["Steel Raw Material","2658","MB-FE-0003","Hot-briquetted iron FOB NOLA US$/tonne","USD","tonne","Weekly",0]
["Steel Raw Material","2659","MB-IRO-0079","Ukrainian/Russian basic pig iron FOB NOLA US$/tonne","USD","tonne","Weekly",0]
["Steel Raw Material","2685","MB-IRO-0080","Iron ore implied pellet premium CFR Qingdao US $ per tonne","USD","tonne","weekly",0]
["Steel Raw Material","276","MB-IRO-0007","China domestic pig iron yuan per tonne del warehouse","RMB","tonne","weekly",0]
["Steel Raw Material","424","MB-IRO-0008","MBIO Index Iron Ore 62% Fe fines CFR Qingdao US $/tonne","USD","tonne","daily",0]
["Steel Raw Material","425","MB-IRO-0009","Iron Ore 65% Fe Brazilian origin high grade sinter fines CFR Qingdao US $ per tonne","USD","tonne","daily",0]
["Steel Raw Material","426","MB-IRO-0010","Iron Ore 63% Fe Australian origin lump premium CFR Qingdao US cents per dry metric tonne unit","US Cents","dry metric tonne","daily",0]
["Steel Raw Material","443","MB-IRO-0011","Iron Ore 62% Fe sinter fines, FOT main Chinese ports, RMB per wet tonne","RMB","tonne","daily",0]
["Steel Raw Material","444","MB-IRO-0012","Iron Ore 65% Fe blast furnace pellet CFR Qingdao basis US $ per tonne","USD","tonne","weekly",0]
["Steel Raw Material","445","MB-IRO-0013","Iron Ore 66% Fe concentrate CFR Qingdao US $ per tonne","USD","tonne","weekly",0]
["Steel Raw Material","46","MB-IRO-0001","CIS export pig iron Baltic Sea $ per tonne fob main port","USD","tonne","weekly",0]
["Steel Raw Material","47","MB-IRO-0002","CIS export pig iron Black Sea $ per tonne fob main port","USD","tonne","weekly",0]